{"text_format":"1","workbook":"xlsx","n_sheets":4,"sheets":["CG","Sheet2","Sheet3","Sys"],"not_rendered":{"charts":0,"images":3,"macros":1,"external_links":0,"defined_names":2,"comments":0,"pivot_tables":0},"unopened":[],"bounds":{"document_bytes":16777216,"sheet_cells":100000,"rows_first":2000,"rows_last":500,"rows_between":2000,"halvings":0,"cell_chars":16384,"cell_head_chars":4096},"cells_cut":0,"cells_raw":0,"read":"whole","date_system":"1900"}

{"sheet":"CG","index":0,"n_rows":311,"n_cols":35,"rows_kept":311,"cut":false,"hidden":false,"merged":[[2,12,2,15],[2,0,2,4],[2,6,2,10],[0,3,1,3],[0,0,1,0]]}
["Name",null,null,"F.Y.",null,null,null,null,null,null,null,null,null,null,null,null,null,null,null,null,null,"Yes",null,null,null,null,null,null,"Broker   ----->","A","B","C","D","E","F"]
[null,null,null,null,null,null,null,null,null,null,null,null,null,null,null,null,null,null,null,null,null,null,null,null,null,1,0,null,"Initials ----->",1,2,3,4,5,6]
["Purchase",null,null,null,null,"Bonus","Sale",null,null,null,null,"Date of","Stock",null,null,null,null,null,"POH",null,null,null,null,null,null,0,0]
["Date","Scrip name","Qty.","Rate","Amt.",null,"Date","Scrip name","Qty. ","Rate","Amt.","pur","Scrip name","Qty.","Rate","Amt.","STCG","LTCG","(days)","Status","Broker",null,null,null,null,1,0]
[null,null,null,{"$f":"IF(AND(E5<>0,C5<>0),E5/C5,IF(F5=\"Yes\",0,\"-\"))","v":"-"},null,null,null,null,null,{"$f":"IF(AND(K5<>0,I5<>0),K5/I5,\"-\")","v":"-"},null,{"$f":"IF(P5<>\"-\",A5,IF(F5=\"Yes\",IF(A5=\"\",\"-\",A5),\"-\"))","v":"-"},{"$f":"IF((C5-I5)<>0,IF(C5=N5,B5,IF(B5=H5,B5,IF(B5=\"\",\"PUR?\",\"MISMATCH!\"))),(IF(B5=H5,IF(B5=\"\",\"-\",B5),\"MISMATCH\")))","v":"-"},{"$f":"IF((C5-I5)<>0,C5-I5,\"-\")","v":"-"},{"$f":"IF(M5=\"MISMATCH!\",\"-\",IF(N5<0,\"PUR?\",D5))","v":"-"},{"$f":"IF(M5=\"MISMATCH!\",\"-\",IF(N5<>\"-\",IF(N5<0,\"PUR?\",N5*O5),\"-\"))","v":"-"},{"$f":"IF(M5=\"MISMATCH!\",\"-\",IF(AND(S5<=365,C5-I5>=0,S5<>\"Date?\",S5<>\"\"),IF(D5=J5,\"-\",IF(OR(I5=\"\",K5=\"\"),\"-\",I5*(J5-D5))),\"-\"))","v":"-"},{"$f":"IF(M5=\"MISMATCH!\",\"-\",IF(AND(S5>365,C5-I5>=0,S5<>\"Date?\",S5<>\"\"),IF(D5=J5,\"-\",IF(OR(I5=\"\",K5=\"\"),\"-\",I5*(J5-D5))),\"-\"))","v":"-"},{"$f":"IF(M5=\"MISMATCH!\",\"-\",IF(AND(A5<>\"\",G5<>\"\"),G5-A5+1,\"DATE?\"))","v":"DATE?"},{"$f":"IF(AND(N5<>\"-\",N5>0),IF(Q5<>\"-\",IF(A5=G5,\"Stk,Intra day\",\"Stk,STCG\"),IF(R5<>\"-\",\"Stk,LTCG\",IF(N5=\"-\",\"-\",\"Stk\"))),IF(N5<0,\"-ve Stk\",IF(Q5<>\"-\",IF(A5=G5,\"Intra day\",\"STCG\"),IF(R5<>\"-\",\"LTCG\",\"-\"))))","v":"-"}]
[null,null,null,"-",null,null,null,null,null,"-",null,"-","-","-","-","-","-","-","DATE?","-"]
[null,null,null,"-",null,null,null,null,null,"-",null,"-","-","-","-","-","-","-","DATE?","-"]
[null,null,null,"-",null,null,null,null,null,"-",null,"-","-","-","-","-","-","-","DATE?","-"]
[null,null,null,"-",null,null,null,null,null,"-",null,"-","-","-","-","-","-","-","DATE?","-"]
[null,null,null,"-",null,null,null,null,null,"-",null,"-","-","-","-","-","-","-","DATE?","-"]
[null,null,null,"-",null,null,null,null,null,"-",null,"-","-","-","-","-","-","-","DATE?","-"]
[null,null,null,{"$f":"IF(AND(E12<>0,C12<>0),E12/C12,IF(F12=\"Yes\",0,\"-\"))","v":"-"},null,null,null,null,null,{"$f":"IF(AND(K12<>0,I12<>0),K12/I12,\"-\")","v":"-"},null,{"$f":"IF(P12<>\"-\",A12,IF(F12=\"Yes\",IF(A12=\"\",\"-\",A12),\"-\"))","v":"-"},{"$f":"IF((C12-I12)<>0,IF(C12=N12,B12,IF(B12=H12,B12,IF(B12=\"\",\"PUR?\",\"MISMATCH!\"))),(IF(B12=H12,IF(B12=\"\",\"-\",B12),\"MISMATCH\")))","v":"-"},{"$f":"IF((C12-I12)<>0,C12-I12,\"-\")","v":"-"},{"$f":"IF(M12=\"MISMATCH!\",\"-\",IF(N12<0,\"PUR?\",D12))","v":"-"},{"$f":"IF(M12=\"MISMATCH!\",\"-\",IF(N12<>\"-\",IF(N12<0,\"PUR?\",N12*O12),\"-\"))","v":"-"},{"$f":"IF(M12=\"MISMATCH!\",\"-\",IF(AND(S12<=365,C12-I12>=0,S12<>\"Date?\",S12<>\"\"),IF(D12=J12,\"-\",IF(OR(I12=\"\",K12=\"\"),\"-\",I12*(J12-D12))),\"-\"))","v":"-"},{"$f":"IF(M12=\"MISMATCH!\",\"-\",IF(AND(S12>365,C12-I12>=0,S12<>\"Date?\",S12<>\"\"),IF(D12=J12,\"-\",IF(OR(I12=\"\",K12=\"\"),\"-\",I12*(J12-D12))),\"-\"))","v":"-"},{"$f":"IF(M12=\"MISMATCH!\",\"-\",IF(AND(A12<>\"\",G12<>\"\"),G12-A12+1,\"DATE?\"))","v":"DATE?"},{"$f":"IF(AND(N12<>\"-\",N12>0),IF(Q12<>\"-\",IF(A12=G12,\"Stk,Intra day\",\"Stk,STCG\"),IF(R12<>\"-\",\"Stk,LTCG\",IF(N12=\"-\",\"-\",\"Stk\"))),IF(N12<0,\"-ve Stk\",IF(Q12<>\"-\",IF(A12=G12,\"Intra day\",\"STCG\"),IF(R12<>\"-\",\"LTCG\",\"-\"))))","v":"-"}]
[null,null,null,"-",null,null,null,null,null,"-",null,"-","-","-","-","-","-","-","DATE?","-"]
[null,null,null,"-",null,null,null,null,null,"-",null,"-","-","-","-","-","-","-","DATE?","-"]
[null,null,null,"-",null,null,null,null,null,"-",null,"-","-","-","-","-","-","-","DATE?","-"]
[null,null,null,{"$f":"IF(AND(E16<>0,C16<>0),E16/C16,IF(F16=\"Yes\",0,\"-\"))","v":"-"},null,null,null,null,null,{"$f":"IF(AND(K16<>0,I16<>0),K16/I16,\"-\")","v":"-"},null,{"$f":"IF(P16<>\"-\",A16,IF(F16=\"Yes\",IF(A16=\"\",\"-\",A16),\"-\"))","v":"-"},{"$f":"IF((C16-I16)<>0,IF(C16=N16,B16,IF(B16=H16,B16,IF(B16=\"\",\"PUR?\",\"MISMATCH!\"))),(IF(B16=H16,IF(B16=\"\",\"-\",B16),\"MISMATCH\")))","v":"-"},{"$f":"IF((C16-I16)<>0,C16-I16,\"-\")","v":"-"},{"$f":"IF(M16=\"MISMATCH!\",\"-\",IF(N16<0,\"PUR?\",D16))","v":"-"},{"$f":"IF(M16=\"MISMATCH!\",\"-\",IF(N16<>\"-\",IF(N16<0,\"PUR?\",N16*O16),\"-\"))","v":"-"},{"$f":"IF(M16=\"MISMATCH!\",\"-\",IF(AND(S16<=365,C16-I16>=0,S16<>\"Date?\",S16<>\"\"),IF(D16=J16,\"-\",IF(OR(I16=\"\",K16=\"\"),\"-\",I16*(J16-D16))),\"-\"))","v":"-"},{"$f":"IF(M16=\"MISMATCH!\",\"-\",IF(AND(S16>365,C16-I16>=0,S16<>\"Date?\",S16<>\"\"),IF(D16=J16,\"-\",IF(OR(I16=\"\",K16=\"\"),\"-\",I16*(J16-D16))),\"-\"))","v":"-"},{"$f":"IF(M16=\"MISMATCH!\",\"-\",IF(AND(A16<>\"\",G16<>\"\"),G16-A16+1,\"DATE?\"))","v":"DATE?"},{"$f":"IF(AND(N16<>\"-\",N16>0),IF(Q16<>\"-\",IF(A16=G16,\"Stk,Intra day\",\"Stk,STCG\"),IF(R16<>\"-\",\"Stk,LTCG\",IF(N16=\"-\",\"-\",\"Stk\"))),IF(N16<0,\"-ve Stk\",IF(Q16<>\"-\",IF(A16=G16,\"Intra day\",\"STCG\"),IF(R16<>\"-\",\"LTCG\",\"-\"))))","v":"-"}]
[null,null,null,"-",null,null,null,null,null,"-",null,"-","-","-","-","-","-","-","DATE?","-"]
[null,null,null,"-",null,null,null,null,null,"-",null,"-","-","-","-","-","-","-","DATE?","-"]
[null,null,null,"-",null,null,null,null,null,"-",null,"-","-","-","-","-","-","-","DATE?","-"]
[null,null,null,"-",null,null,null,null,null,"-",null,"-","-","-","-","-","-","-","DATE?","-"]
[null,null,null,"-",null,null,null,null,null,"-",null,"-","-","-","-","-","-","-","DATE?","-"]
[null,null,null,"-",null,null,null,null,null,"-",null,"-","-","-","-","-","-","-","DATE?","-"]
[null,null,null,"-",null,null,null,null,null,"-",null,"-","-","-","-","-","-","-","DATE?","-"]
[null,null,null,"-",null,null,null,null,null,"-",null,"-","-","-","-","-","-","-","DATE?","-"]
[null,null,null,{"$f":"IF(AND(E25<>0,C25<>0),E25/C25,IF(F25=\"Yes\",0,\"-\"))","v":"-"},null,null,null,null,null,{"$f":"IF(AND(K25<>0,I25<>0),K25/I25,\"-\")","v":"-"},null,{"$f":"IF(P25<>\"-\",A25,IF(F25=\"Yes\",IF(A25=\"\",\"-\",A25),\"-\"))","v":"-"},{"$f":"IF((C25-I25)<>0,IF(C25=N25,B25,IF(B25=H25,B25,IF(B25=\"\",\"PUR?\",\"MISMATCH!\"))),(IF(B25=H25,IF(B25=\"\",\"-\",B25),\"MISMATCH\")))","v":"-"},{"$f":"IF((C25-I25)<>0,C25-I25,\"-\")","v":"-"},{"$f":"IF(M25=\"MISMATCH!\",\"-\",IF(N25<0,\"PUR?\",D25))","v":"-"},{"$f":"IF(M25=\"MISMATCH!\",\"-\",IF(N25<>\"-\",IF(N25<0,\"PUR?\",N25*O25),\"-\"))","v":"-"},{"$f":"IF(M25=\"MISMATCH!\",\"-\",IF(AND(S25<=365,C25-I25>=0,S25<>\"Date?\",S25<>\"\"),IF(D25=J25,\"-\",IF(OR(I25=\"\",K25=\"\"),\"-\",I25*(J25-D25))),\"-\"))","v":"-"},{"$f":"IF(M25=\"MISMATCH!\",\"-\",IF(AND(S25>365,C25-I25>=0,S25<>\"Date?\",S25<>\"\"),IF(D25=J25,\"-\",IF(OR(I25=\"\",K25=\"\"),\"-\",I25*(J25-D25))),\"-\"))","v":"-"},{"$f":"IF(M25=\"MISMATCH!\",\"-\",IF(AND(A25<>\"\",G25<>\"\"),G25-A25+1,\"DATE?\"))","v":"DATE?"},{"$f":"IF(AND(N25<>\"-\",N25>0),IF(Q25<>\"-\",IF(A25=G25,\"Stk,Intra day\",\"Stk,STCG\"),IF(R25<>\"-\",\"Stk,LTCG\",IF(N25=\"-\",\"-\",\"Stk\"))),IF(N25<0,\"-ve Stk\",IF(Q25<>\"-\",IF(A25=G25,\"Intra day\",\"STCG\"),IF(R25<>\"-\",\"LTCG\",\"-\"))))","v":"-"}]
[null,null,null,"-",null,null,null,null,null,"-",null,"-","-","-","-","-","-","-","DATE?","-"]
[null,null,null,"-",null,null,null,null,null,"-",null,"-","-","-","-","-","-","-","DATE?","-"]
[null,null,null,"-",null,null,null,null,null,"-",null,"-","-","-","-","-","-","-","DATE?","-"]
[null,null,null,{"$f":"IF(AND(E29<>0,C29<>0),E29/C29,IF(F29=\"Yes\",0,\"-\"))","v":"-"},null,null,null,null,null,{"$f":"IF(AND(K29<>0,I29<>0),K29/I29,\"-\")","v":"-"},null,{"$f":"IF(P29<>\"-\",A29,IF(F29=\"Yes\",IF(A29=\"\",\"-\",A29),\"-\"))","v":"-"},{"$f":"IF((C29-I29)<>0,IF(C29=N29,B29,IF(B29=H29,B29,IF(B29=\"\",\"PUR?\",\"MISMATCH!\"))),(IF(B29=H29,IF(B29=\"\",\"-\",B29),\"MISMATCH\")))","v":"-"},{"$f":"IF((C29-I29)<>0,C29-I29,\"-\")","v":"-"},{"$f":"IF(M29=\"MISMATCH!\",\"-\",IF(N29<0,\"PUR?\",D29))","v":"-"},{"$f":"IF(M29=\"MISMATCH!\",\"-\",IF(N29<>\"-\",IF(N29<0,\"PUR?\",N29*O29),\"-\"))","v":"-"},{"$f":"IF(M29=\"MISMATCH!\",\"-\",IF(AND(S29<=365,C29-I29>=0,S29<>\"Date?\",S29<>\"\"),IF(D29=J29,\"-\",IF(OR(I29=\"\",K29=\"\"),\"-\",I29*(J29-D29))),\"-\"))","v":"-"},{"$f":"IF(M29=\"MISMATCH!\",\"-\",IF(AND(S29>365,C29-I29>=0,S29<>\"Date?\",S29<>\"\"),IF(D29=J29,\"-\",IF(OR(I29=\"\",K29=\"\"),\"-\",I29*(J29-D29))),\"-\"))","v":"-"},{"$f":"IF(M29=\"MISMATCH!\",\"-\",IF(AND(A29<>\"\",G29<>\"\"),G29-A29+1,\"DATE?\"))","v":"DATE?"},{"$f":"IF(AND(N29<>\"-\",N29>0),IF(Q29<>\"-\",IF(A29=G29,\"Stk,Intra day\",\"Stk,STCG\"),IF(R29<>\"-\",\"Stk,LTCG\",IF(N29=\"-\",\"-\",\"Stk\"))),IF(N29<0,\"-ve Stk\",IF(Q29<>\"-\",IF(A29=G29,\"Intra day\",\"STCG\"),IF(R29<>\"-\",\"LTCG\",\"-\"))))","v":"-"}]
[null,null,null,"-",null,null,null,null,null,"-",null,"-","-","-","-","-","-","-","DATE?","-"]
[null,null,null,{"$f":"IF(AND(E31<>0,C31<>0),E31/C31,IF(F31=\"Yes\",0,\"-\"))","v":"-"},null,null,null,null,null,{"$f":"IF(AND(K31<>0,I31<>0),K31/I31,\"-\")","v":"-"},null,{"$f":"IF(P31<>\"-\",A31,IF(F31=\"Yes\",IF(A31=\"\",\"-\",A31),\"-\"))","v":"-"},{"$f":"IF((C31-I31)<>0,IF(C31=N31,B31,IF(B31=H31,B31,IF(B31=\"\",\"PUR?\",\"MISMATCH!\"))),(IF(B31=H31,IF(B31=\"\",\"-\",B31),\"MISMATCH\")))","v":"-"},{"$f":"IF((C31-I31)<>0,C31-I31,\"-\")","v":"-"},{"$f":"IF(M31=\"MISMATCH!\",\"-\",IF(N31<0,\"PUR?\",D31))","v":"-"},{"$f":"IF(M31=\"MISMATCH!\",\"-\",IF(N31<>\"-\",IF(N31<0,\"PUR?\",N31*O31),\"-\"))","v":"-"},{"$f":"IF(M31=\"MISMATCH!\",\"-\",IF(AND(S31<=365,C31-I31>=0,S31<>\"Date?\",S31<>\"\"),IF(D31=J31,\"-\",IF(OR(I31=\"\",K31=\"\"),\"-\",I31*(J31-D31))),\"-\"))","v":"-"},{"$f":"IF(M31=\"MISMATCH!\",\"-\",IF(AND(S31>365,C31-I31>=0,S31<>\"Date?\",S31<>\"\"),IF(D31=J31,\"-\",IF(OR(I31=\"\",K31=\"\"),\"-\",I31*(J31-D31))),\"-\"))","v":"-"},{"$f":"IF(M31=\"MISMATCH!\",\"-\",IF(AND(A31<>\"\",G31<>\"\"),G31-A31+1,\"DATE?\"))","v":"DATE?"},{"$f":"IF(AND(N31<>\"-\",N31>0),IF(Q31<>\"-\",IF(A31=G31,\"Stk,Intra day\",\"Stk,STCG\"),IF(R31<>\"-\",\"Stk,LTCG\",IF(N31=\"-\",\"-\",\"Stk\"))),IF(N31<0,\"-ve Stk\",IF(Q31<>\"-\",IF(A31=G31,\"Intra day\",\"STCG\"),IF(R31<>\"-\",\"LTCG\",\"-\"))))","v":"-"}]
[null,null,null,{"$f":"IF(AND(E32<>0,C32<>0),E32/C32,IF(F32=\"Yes\",0,\"-\"))","v":"-"},null,null,null,null,null,{"$f":"IF(AND(K32<>0,I32<>0),K32/I32,\"-\")","v":"-"},null,{"$f":"IF(P32<>\"-\",A32,IF(F32=\"Yes\",IF(A32=\"\",\"-\",A32),\"-\"))","v":"-"},{"$f":"IF((C32-I32)<>0,IF(C32=N32,B32,IF(B32=H32,B32,IF(B32=\"\",\"PUR?\",\"MISMATCH!\"))),(IF(B32=H32,IF(B32=\"\",\"-\",B32),\"MISMATCH\")))","v":"-"},{"$f":"IF((C32-I32)<>0,C32-I32,\"-\")","v":"-"},{"$f":"IF(M32=\"MISMATCH!\",\"-\",IF(N32<0,\"PUR?\",D32))","v":"-"},{"$f":"IF(M32=\"MISMATCH!\",\"-\",IF(N32<>\"-\",IF(N32<0,\"PUR?\",N32*O32),\"-\"))","v":"-"},{"$f":"IF(M32=\"MISMATCH!\",\"-\",IF(AND(S32<=365,C32-I32>=0,S32<>\"Date?\",S32<>\"\"),IF(D32=J32,\"-\",IF(OR(I32=\"\",K32=\"\"),\"-\",I32*(J32-D32))),\"-\"))","v":"-"},{"$f":"IF(M32=\"MISMATCH!\",\"-\",IF(AND(S32>365,C32-I32>=0,S32<>\"Date?\",S32<>\"\"),IF(D32=J32,\"-\",IF(OR(I32=\"\",K32=\"\"),\"-\",I32*(J32-D32))),\"-\"))","v":"-"},{"$f":"IF(M32=\"MISMATCH!\",\"-\",IF(AND(A32<>\"\",G32<>\"\"),G32-A32+1,\"DATE?\"))","v":"DATE?"},{"$f":"IF(AND(N32<>\"-\",N32>0),IF(Q32<>\"-\",IF(A32=G32,\"Stk,Intra day\",\"Stk,STCG\"),IF(R32<>\"-\",\"Stk,LTCG\",IF(N32=\"-\",\"-\",\"Stk\"))),IF(N32<0,\"-ve Stk\",IF(Q32<>\"-\",IF(A32=G32,\"Intra day\",\"STCG\"),IF(R32<>\"-\",\"LTCG\",\"-\"))))","v":"-"}]
[null,null,null,{"$f":"IF(AND(E33<>0,C33<>0),E33/C33,IF(F33=\"Yes\",0,\"-\"))","v":"-"},null,null,null,null,null,{"$f":"IF(AND(K33<>0,I33<>0),K33/I33,\"-\")","v":"-"},null,{"$f":"IF(P33<>\"-\",A33,IF(F33=\"Yes\",IF(A33=\"\",\"-\",A33),\"-\"))","v":"-"},{"$f":"IF((C33-I33)<>0,IF(C33=N33,B33,IF(B33=H33,B33,IF(B33=\"\",\"PUR?\",\"MISMATCH!\"))),(IF(B33=H33,IF(B33=\"\",\"-\",B33),\"MISMATCH\")))","v":"-"},{"$f":"IF((C33-I33)<>0,C33-I33,\"-\")","v":"-"},{"$f":"IF(M33=\"MISMATCH!\",\"-\",IF(N33<0,\"PUR?\",D33))","v":"-"},{"$f":"IF(M33=\"MISMATCH!\",\"-\",IF(N33<>\"-\",IF(N33<0,\"PUR?\",N33*O33),\"-\"))","v":"-"},{"$f":"IF(M33=\"MISMATCH!\",\"-\",IF(AND(S33<=365,C33-I33>=0,S33<>\"Date?\",S33<>\"\"),IF(D33=J33,\"-\",IF(OR(I33=\"\",K33=\"\"),\"-\",I33*(J33-D33))),\"-\"))","v":"-"},{"$f":"IF(M33=\"MISMATCH!\",\"-\",IF(AND(S33>365,C33-I33>=0,S33<>\"Date?\",S33<>\"\"),IF(D33=J33,\"-\",IF(OR(I33=\"\",K33=\"\"),\"-\",I33*(J33-D33))),\"-\"))","v":"-"},{"$f":"IF(M33=\"MISMATCH!\",\"-\",IF(AND(A33<>\"\",G33<>\"\"),G33-A33+1,\"DATE?\"))","v":"DATE?"},{"$f":"IF(AND(N33<>\"-\",N33>0),IF(Q33<>\"-\",IF(A33=G33,\"Stk,Intra day\",\"Stk,STCG\"),IF(R33<>\"-\",\"Stk,LTCG\",IF(N33=\"-\",\"-\",\"Stk\"))),IF(N33<0,\"-ve Stk\",IF(Q33<>\"-\",IF(A33=G33,\"Intra day\",\"STCG\"),IF(R33<>\"-\",\"LTCG\",\"-\"))))","v":"-"}]
[null,null,null,"-",null,null,null,null,null,"-",null,"-","-","-","-","-","-","-","DATE?","-"]
[null,null,null,{"$f":"IF(AND(E35<>0,C35<>0),E35/C35,IF(F35=\"Yes\",0,\"-\"))","v":"-"},null,null,null,null,null,{"$f":"IF(AND(K35<>0,I35<>0),K35/I35,\"-\")","v":"-"},null,{"$f":"IF(P35<>\"-\",A35,IF(F35=\"Yes\",IF(A35=\"\",\"-\",A35),\"-\"))","v":"-"},{"$f":"IF((C35-I35)<>0,IF(C35=N35,B35,IF(B35=H35,B35,IF(B35=\"\",\"PUR?\",\"MISMATCH!\"))),(IF(B35=H35,IF(B35=\"\",\"-\",B35),\"MISMATCH\")))","v":"-"},{"$f":"IF((C35-I35)<>0,C35-I35,\"-\")","v":"-"},{"$f":"IF(M35=\"MISMATCH!\",\"-\",IF(N35<0,\"PUR?\",D35))","v":"-"},{"$f":"IF(M35=\"MISMATCH!\",\"-\",IF(N35<>\"-\",IF(N35<0,\"PUR?\",N35*O35),\"-\"))","v":"-"},{"$f":"IF(M35=\"MISMATCH!\",\"-\",IF(AND(S35<=365,C35-I35>=0,S35<>\"Date?\",S35<>\"\"),IF(D35=J35,\"-\",IF(OR(I35=\"\",K35=\"\"),\"-\",I35*(J35-D35))),\"-\"))","v":"-"},{"$f":"IF(M35=\"MISMATCH!\",\"-\",IF(AND(S35>365,C35-I35>=0,S35<>\"Date?\",S35<>\"\"),IF(D35=J35,\"-\",IF(OR(I35=\"\",K35=\"\"),\"-\",I35*(J35-D35))),\"-\"))","v":"-"},{"$f":"IF(M35=\"MISMATCH!\",\"-\",IF(AND(A35<>\"\",G35<>\"\"),G35-A35+1,\"DATE?\"))","v":"DATE?"},{"$f":"IF(AND(N35<>\"-\",N35>0),IF(Q35<>\"-\",IF(A35=G35,\"Stk,Intra day\",\"Stk,STCG\"),IF(R35<>\"-\",\"Stk,LTCG\",IF(N35=\"-\",\"-\",\"Stk\"))),IF(N35<0,\"-ve Stk\",IF(Q35<>\"-\",IF(A35=G35,\"Intra day\",\"STCG\"),IF(R35<>\"-\",\"LTCG\",\"-\"))))","v":"-"}]
[null,null,null,{"$f":"IF(AND(E36<>0,C36<>0),E36/C36,IF(F36=\"Yes\",0,\"-\"))","v":"-"},null,null,null,null,null,{"$f":"IF(AND(K36<>0,I36<>0),K36/I36,\"-\")","v":"-"},null,{"$f":"IF(P36<>\"-\",A36,IF(F36=\"Yes\",IF(A36=\"\",\"-\",A36),\"-\"))","v":"-"},{"$f":"IF((C36-I36)<>0,IF(C36=N36,B36,IF(B36=H36,B36,IF(B36=\"\",\"PUR?\",\"MISMATCH!\"))),(IF(B36=H36,IF(B36=\"\",\"-\",B36),\"MISMATCH\")))","v":"-"},{"$f":"IF((C36-I36)<>0,C36-I36,\"-\")","v":"-"},{"$f":"IF(M36=\"MISMATCH!\",\"-\",IF(N36<0,\"PUR?\",D36))","v":"-"},{"$f":"IF(M36=\"MISMATCH!\",\"-\",IF(N36<>\"-\",IF(N36<0,\"PUR?\",N36*O36),\"-\"))","v":"-"},{"$f":"IF(M36=\"MISMATCH!\",\"-\",IF(AND(S36<=365,C36-I36>=0,S36<>\"Date?\",S36<>\"\"),IF(D36=J36,\"-\",IF(OR(I36=\"\",K36=\"\"),\"-\",I36*(J36-D36))),\"-\"))","v":"-"},{"$f":"IF(M36=\"MISMATCH!\",\"-\",IF(AND(S36>365,C36-I36>=0,S36<>\"Date?\",S36<>\"\"),IF(D36=J36,\"-\",IF(OR(I36=\"\",K36=\"\"),\"-\",I36*(J36-D36))),\"-\"))","v":"-"},{"$f":"IF(M36=\"MISMATCH!\",\"-\",IF(AND(A36<>\"\",G36<>\"\"),G36-A36+1,\"DATE?\"))","v":"DATE?"},{"$f":"IF(AND(N36<>\"-\",N36>0),IF(Q36<>\"-\",IF(A36=G36,\"Stk,Intra day\",\"Stk,STCG\"),IF(R36<>\"-\",\"Stk,LTCG\",IF(N36=\"-\",\"-\",\"Stk\"))),IF(N36<0,\"-ve Stk\",IF(Q36<>\"-\",IF(A36=G36,\"Intra day\",\"STCG\"),IF(R36<>\"-\",\"LTCG\",\"-\"))))","v":"-"}]
[null,null,null,"-",null,null,null,null,null,"-",null,"-","-","-","-","-","-","-","DATE?","-"]
[null,null,null,"-",null,null,null,null,null,"-",null,"-","-","-","-","-","-","-","DATE?","-"]
[null,null,null,"-",null,null,null,null,null,"-",null,"-","-","-","-","-","-","-","DATE?","-"]
[null,null,null,"-",null,null,null,null,null,"-",null,"-","-","-","-","-","-","-","DATE?","-"]
[null,null,null,"-",null,null,null,null,null,"-",null,"-","-","-","-","-","-","-","DATE?","-"]
[null,null,null,"-",null,null,null,null,null,"-",null,"-","-","-","-","-","-","-","DATE?","-"]
[null,null,null,"-",null,null,null,null,null,"-",null,"-","-","-","-","-","-","-","DATE?","-"]
[null,null,null,"-",null,null,null,null,null,"-",null,"-","-","-","-","-","-","-","DATE?","-"]
[null,null,null,{"$f":"IF(AND(E45<>0,C45<>0),E45/C45,IF(F45=\"Yes\",0,\"-\"))","v":"-"},null,null,null,null,null,{"$f":"IF(AND(K45<>0,I45<>0),K45/I45,\"-\")","v":"-"},null,{"$f":"IF(P45<>\"-\",A45,IF(F45=\"Yes\",IF(A45=\"\",\"-\",A45),\"-\"))","v":"-"},{"$f":"IF((C45-I45)<>0,IF(C45=N45,B45,IF(B45=H45,B45,IF(B45=\"\",\"PUR?\",\"MISMATCH!\"))),(IF(B45=H45,IF(B45=\"\",\"-\",B45),\"MISMATCH\")))","v":"-"},{"$f":"IF((C45-I45)<>0,C45-I45,\"-\")","v":"-"},{"$f":"IF(M45=\"MISMATCH!\",\"-\",IF(N45<0,\"PUR?\",D45))","v":"-"},{"$f":"IF(M45=\"MISMATCH!\",\"-\",IF(N45<>\"-\",IF(N45<0,\"PUR?\",N45*O45),\"-\"))","v":"-"},{"$f":"IF(M45=\"MISMATCH!\",\"-\",IF(AND(S45<=365,C45-I45>=0,S45<>\"Date?\",S45<>\"\"),IF(D45=J45,\"-\",IF(OR(I45=\"\",K45=\"\"),\"-\",I45*(J45-D45))),\"-\"))","v":"-"},{"$f":"IF(M45=\"MISMATCH!\",\"-\",IF(AND(S45>365,C45-I45>=0,S45<>\"Date?\",S45<>\"\"),IF(D45=J45,\"-\",IF(OR(I45=\"\",K45=\"\"),\"-\",I45*(J45-D45))),\"-\"))","v":"-"},{"$f":"IF(M45=\"MISMATCH!\",\"-\",IF(AND(A45<>\"\",G45<>\"\"),G45-A45+1,\"DATE?\"))","v":"DATE?"},{"$f":"IF(AND(N45<>\"-\",N45>0),IF(Q45<>\"-\",IF(A45=G45,\"Stk,Intra day\",\"Stk,STCG\"),IF(R45<>\"-\",\"Stk,LTCG\",IF(N45=\"-\",\"-\",\"Stk\"))),IF(N45<0,\"-ve Stk\",IF(Q45<>\"-\",IF(A45=G45,\"Intra day\",\"STCG\"),IF(R45<>\"-\",\"LTCG\",\"-\"))))","v":"-"}]
[null,null,null,{"$f":"IF(AND(E46<>0,C46<>0),E46/C46,IF(F46=\"Yes\",0,\"-\"))","v":"-"},null,null,null,null,null,{"$f":"IF(AND(K46<>0,I46<>0),K46/I46,\"-\")","v":"-"},null,{"$f":"IF(P46<>\"-\",A46,IF(F46=\"Yes\",IF(A46=\"\",\"-\",A46),\"-\"))","v":"-"},{"$f":"IF((C46-I46)<>0,IF(C46=N46,B46,IF(B46=H46,B46,IF(B46=\"\",\"PUR?\",\"MISMATCH!\"))),(IF(B46=H46,IF(B46=\"\",\"-\",B46),\"MISMATCH\")))","v":"-"},{"$f":"IF((C46-I46)<>0,C46-I46,\"-\")","v":"-"},{"$f":"IF(M46=\"MISMATCH!\",\"-\",IF(N46<0,\"PUR?\",D46))","v":"-"},{"$f":"IF(M46=\"MISMATCH!\",\"-\",IF(N46<>\"-\",IF(N46<0,\"PUR?\",N46*O46),\"-\"))","v":"-"},{"$f":"IF(M46=\"MISMATCH!\",\"-\",IF(AND(S46<=365,C46-I46>=0,S46<>\"Date?\",S46<>\"\"),IF(D46=J46,\"-\",IF(OR(I46=\"\",K46=\"\"),\"-\",I46*(J46-D46))),\"-\"))","v":"-"},{"$f":"IF(M46=\"MISMATCH!\",\"-\",IF(AND(S46>365,C46-I46>=0,S46<>\"Date?\",S46<>\"\"),IF(D46=J46,\"-\",IF(OR(I46=\"\",K46=\"\"),\"-\",I46*(J46-D46))),\"-\"))","v":"-"},{"$f":"IF(M46=\"MISMATCH!\",\"-\",IF(AND(A46<>\"\",G46<>\"\"),G46-A46+1,\"DATE?\"))","v":"DATE?"},{"$f":"IF(AND(N46<>\"-\",N46>0),IF(Q46<>\"-\",IF(A46=G46,\"Stk,Intra day\",\"Stk,STCG\"),IF(R46<>\"-\",\"Stk,LTCG\",IF(N46=\"-\",\"-\",\"Stk\"))),IF(N46<0,\"-ve Stk\",IF(Q46<>\"-\",IF(A46=G46,\"Intra day\",\"STCG\"),IF(R46<>\"-\",\"LTCG\",\"-\"))))","v":"-"}]
[null,null,null,{"$f":"IF(AND(E47<>0,C47<>0),E47/C47,IF(F47=\"Yes\",0,\"-\"))","v":"-"},null,null,null,null,null,{"$f":"IF(AND(K47<>0,I47<>0),K47/I47,\"-\")","v":"-"},null,{"$f":"IF(P47<>\"-\",A47,IF(F47=\"Yes\",IF(A47=\"\",\"-\",A47),\"-\"))","v":"-"},{"$f":"IF((C47-I47)<>0,IF(C47=N47,B47,IF(B47=H47,B47,IF(B47=\"\",\"PUR?\",\"MISMATCH!\"))),(IF(B47=H47,IF(B47=\"\",\"-\",B47),\"MISMATCH\")))","v":"-"},{"$f":"IF((C47-I47)<>0,C47-I47,\"-\")","v":"-"},{"$f":"IF(M47=\"MISMATCH!\",\"-\",IF(N47<0,\"PUR?\",D47))","v":"-"},{"$f":"IF(M47=\"MISMATCH!\",\"-\",IF(N47<>\"-\",IF(N47<0,\"PUR?\",N47*O47),\"-\"))","v":"-"},{"$f":"IF(M47=\"MISMATCH!\",\"-\",IF(AND(S47<=365,C47-I47>=0,S47<>\"Date?\",S47<>\"\"),IF(D47=J47,\"-\",IF(OR(I47=\"\",K47=\"\"),\"-\",I47*(J47-D47))),\"-\"))","v":"-"},{"$f":"IF(M47=\"MISMATCH!\",\"-\",IF(AND(S47>365,C47-I47>=0,S47<>\"Date?\",S47<>\"\"),IF(D47=J47,\"-\",IF(OR(I47=\"\",K47=\"\"),\"-\",I47*(J47-D47))),\"-\"))","v":"-"},{"$f":"IF(M47=\"MISMATCH!\",\"-\",IF(AND(A47<>\"\",G47<>\"\"),G47-A47+1,\"DATE?\"))","v":"DATE?"},{"$f":"IF(AND(N47<>\"-\",N47>0),IF(Q47<>\"-\",IF(A47=G47,\"Stk,Intra day\",\"Stk,STCG\"),IF(R47<>\"-\",\"Stk,LTCG\",IF(N47=\"-\",\"-\",\"Stk\"))),IF(N47<0,\"-ve Stk\",IF(Q47<>\"-\",IF(A47=G47,\"Intra day\",\"STCG\"),IF(R47<>\"-\",\"LTCG\",\"-\"))))","v":"-"}]
[null,null,null,"-",null,null,null,null,null,"-",null,"-","-","-","-","-","-","-","DATE?","-"]
[null,null,null,"-",null,null,null,null,null,"-",null,"-","-","-","-","-","-","-","DATE?","-"]
[null,null,null,"-",null,null,null,null,null,"-",null,"-","-","-","-","-","-","-","DATE?","-"]
[null,null,null,"-",null,null,null,null,null,"-",null,"-","-","-","-","-","-","-","DATE?","-"]
[null,null,null,"-",null,null,null,null,null,"-",null,"-","-","-","-","-","-","-","DATE?","-"]
[null,null,null,"-",null,null,null,null,null,"-",null,"-","-","-","-","-","-","-","DATE?","-"]
[null,null,null,"-",null,null,null,null,null,"-",null,"-","-","-","-","-","-","-","DATE?","-"]
[null,null,null,"-",null,null,null,null,null,"-",null,"-","-","-","-","-","-","-","DATE?","-"]
[null,null,null,"-",null,null,null,null,null,"-",null,"-","-","-","-","-","-","-","DATE?","-"]
[null,null,null,"-",null,null,null,null,null,"-",null,"-","-","-","-","-","-","-","DATE?","-"]
[null,null,null,"-",null,null,null,null,null,"-",null,"-","-","-","-","-","-","-","DATE?","-"]
[null,null,null,"-",null,null,null,null,null,"-",null,"-","-","-","-","-","-","-","DATE?","-"]
[null,null,null,"-",null,null,null,null,null,"-",null,"-","-","-","-","-","-","-","DATE?","-"]
[null,null,null,"-",null,null,null,null,null,"-",null,"-","-","-","-","-","-","-","DATE?","-"]
[null,null,null,"-",null,null,null,null,null,"-",null,"-","-","-","-","-","-","-","DATE?","-"]
[null,null,null,"-",null,null,null,null,null,"-",null,"-","-","-","-","-","-","-","DATE?","-"]
[null,null,null,{"$f":"IF(AND(E64<>0,C64<>0),E64/C64,IF(F64=\"Yes\",0,\"-\"))","v":"-"},null,null,null,null,null,{"$f":"IF(AND(K64<>0,I64<>0),K64/I64,\"-\")","v":"-"},null,{"$f":"IF(P64<>\"-\",A64,IF(F64=\"Yes\",IF(A64=\"\",\"-\",A64),\"-\"))","v":"-"},{"$f":"IF((C64-I64)<>0,IF(C64=N64,B64,IF(B64=H64,B64,IF(B64=\"\",\"PUR?\",\"MISMATCH!\"))),(IF(B64=H64,IF(B64=\"\",\"-\",B64),\"MISMATCH\")))","v":"-"},{"$f":"IF((C64-I64)<>0,C64-I64,\"-\")","v":"-"},{"$f":"IF(M64=\"MISMATCH!\",\"-\",IF(N64<0,\"PUR?\",D64))","v":"-"},{"$f":"IF(M64=\"MISMATCH!\",\"-\",IF(N64<>\"-\",IF(N64<0,\"PUR?\",N64*O64),\"-\"))","v":"-"},{"$f":"IF(M64=\"MISMATCH!\",\"-\",IF(AND(S64<=365,C64-I64>=0,S64<>\"Date?\",S64<>\"\"),IF(D64=J64,\"-\",IF(OR(I64=\"\",K64=\"\"),\"-\",I64*(J64-D64))),\"-\"))","v":"-"},{"$f":"IF(M64=\"MISMATCH!\",\"-\",IF(AND(S64>365,C64-I64>=0,S64<>\"Date?\",S64<>\"\"),IF(D64=J64,\"-\",IF(OR(I64=\"\",K64=\"\"),\"-\",I64*(J64-D64))),\"-\"))","v":"-"},{"$f":"IF(M64=\"MISMATCH!\",\"-\",IF(AND(A64<>\"\",G64<>\"\"),G64-A64+1,\"DATE?\"))","v":"DATE?"},{"$f":"IF(AND(N64<>\"-\",N64>0),IF(Q64<>\"-\",IF(A64=G64,\"Stk,Intra day\",\"Stk,STCG\"),IF(R64<>\"-\",\"Stk,LTCG\",IF(N64=\"-\",\"-\",\"Stk\"))),IF(N64<0,\"-ve Stk\",IF(Q64<>\"-\",IF(A64=G64,\"Intra day\",\"STCG\"),IF(R64<>\"-\",\"LTCG\",\"-\"))))","v":"-"}]
[null,null,null,"-",null,null,null,null,null,"-",null,"-","-","-","-","-","-","-","DATE?","-"]
[null,null,null,"-",null,null,null,null,null,"-",null,"-","-","-","-","-","-","-","DATE?","-"]
[null,null,null,"-",null,null,null,null,null,"-",null,"-","-","-","-","-","-","-","DATE?","-"]
[null,null,null,"-",null,null,null,null,null,"-",null,"-","-","-","-","-","-","-","DATE?","-"]
[null,null,null,"-",null,null,null,null,null,"-",null,"-","-","-","-","-","-","-","DATE?","-"]
[null,null,null,{"$f":"IF(AND(E70<>0,C70<>0),E70/C70,IF(F70=\"Yes\",0,\"-\"))","v":"-"},null,null,null,null,null,{"$f":"IF(AND(K70<>0,I70<>0),K70/I70,\"-\")","v":"-"},null,{"$f":"IF(P70<>\"-\",A70,IF(F70=\"Yes\",IF(A70=\"\",\"-\",A70),\"-\"))","v":"-"},{"$f":"IF((C70-I70)<>0,IF(C70=N70,B70,IF(B70=H70,B70,IF(B70=\"\",\"PUR?\",\"MISMATCH!\"))),(IF(B70=H70,IF(B70=\"\",\"-\",B70),\"MISMATCH\")))","v":"-"},{"$f":"IF((C70-I70)<>0,C70-I70,\"-\")","v":"-"},{"$f":"IF(M70=\"MISMATCH!\",\"-\",IF(N70<0,\"PUR?\",D70))","v":"-"},{"$f":"IF(M70=\"MISMATCH!\",\"-\",IF(N70<>\"-\",IF(N70<0,\"PUR?\",N70*O70),\"-\"))","v":"-"},{"$f":"IF(M70=\"MISMATCH!\",\"-\",IF(AND(S70<=365,C70-I70>=0,S70<>\"Date?\",S70<>\"\"),IF(D70=J70,\"-\",IF(OR(I70=\"\",K70=\"\"),\"-\",I70*(J70-D70))),\"-\"))","v":"-"},{"$f":"IF(M70=\"MISMATCH!\",\"-\",IF(AND(S70>365,C70-I70>=0,S70<>\"Date?\",S70<>\"\"),IF(D70=J70,\"-\",IF(OR(I70=\"\",K70=\"\"),\"-\",I70*(J70-D70))),\"-\"))","v":"-"},{"$f":"IF(M70=\"MISMATCH!\",\"-\",IF(AND(A70<>\"\",G70<>\"\"),G70-A70+1,\"DATE?\"))","v":"DATE?"},{"$f":"IF(AND(N70<>\"-\",N70>0),IF(Q70<>\"-\",IF(A70=G70,\"Stk,Intra day\",\"Stk,STCG\"),IF(R70<>\"-\",\"Stk,LTCG\",IF(N70=\"-\",\"-\",\"Stk\"))),IF(N70<0,\"-ve Stk\",IF(Q70<>\"-\",IF(A70=G70,\"Intra day\",\"STCG\"),IF(R70<>\"-\",\"LTCG\",\"-\"))))","v":"-"}]
[null,null,null,{"$f":"IF(AND(E71<>0,C71<>0),E71/C71,IF(F71=\"Yes\",0,\"-\"))","v":"-"},null,null,null,null,null,{"$f":"IF(AND(K71<>0,I71<>0),K71/I71,\"-\")","v":"-"},null,{"$f":"IF(P71<>\"-\",A71,IF(F71=\"Yes\",IF(A71=\"\",\"-\",A71),\"-\"))","v":"-"},{"$f":"IF((C71-I71)<>0,IF(C71=N71,B71,IF(B71=H71,B71,IF(B71=\"\",\"PUR?\",\"MISMATCH!\"))),(IF(B71=H71,IF(B71=\"\",\"-\",B71),\"MISMATCH\")))","v":"-"},{"$f":"IF((C71-I71)<>0,C71-I71,\"-\")","v":"-"},{"$f":"IF(M71=\"MISMATCH!\",\"-\",IF(N71<0,\"PUR?\",D71))","v":"-"},{"$f":"IF(M71=\"MISMATCH!\",\"-\",IF(N71<>\"-\",IF(N71<0,\"PUR?\",N71*O71),\"-\"))","v":"-"},{"$f":"IF(M71=\"MISMATCH!\",\"-\",IF(AND(S71<=365,C71-I71>=0,S71<>\"Date?\",S71<>\"\"),IF(D71=J71,\"-\",IF(OR(I71=\"\",K71=\"\"),\"-\",I71*(J71-D71))),\"-\"))","v":"-"},{"$f":"IF(M71=\"MISMATCH!\",\"-\",IF(AND(S71>365,C71-I71>=0,S71<>\"Date?\",S71<>\"\"),IF(D71=J71,\"-\",IF(OR(I71=\"\",K71=\"\"),\"-\",I71*(J71-D71))),\"-\"))","v":"-"},{"$f":"IF(M71=\"MISMATCH!\",\"-\",IF(AND(A71<>\"\",G71<>\"\"),G71-A71+1,\"DATE?\"))","v":"DATE?"},{"$f":"IF(AND(N71<>\"-\",N71>0),IF(Q71<>\"-\",IF(A71=G71,\"Stk,Intra day\",\"Stk,STCG\"),IF(R71<>\"-\",\"Stk,LTCG\",IF(N71=\"-\",\"-\",\"Stk\"))),IF(N71<0,\"-ve Stk\",IF(Q71<>\"-\",IF(A71=G71,\"Intra day\",\"STCG\"),IF(R71<>\"-\",\"LTCG\",\"-\"))))","v":"-"}]
[null,null,null,"-",null,null,null,null,null,"-",null,"-","-","-","-","-","-","-","DATE?","-"]
[null,null,null,"-",null,null,null,null,null,"-",null,"-","-","-","-","-","-","-","DATE?","-"]
[null,null,null,{"$f":"IF(AND(E74<>0,C74<>0),E74/C74,IF(F74=\"Yes\",0,\"-\"))","v":"-"},null,null,null,null,null,{"$f":"IF(AND(K74<>0,I74<>0),K74/I74,\"-\")","v":"-"},null,{"$f":"IF(P74<>\"-\",A74,IF(F74=\"Yes\",IF(A74=\"\",\"-\",A74),\"-\"))","v":"-"},{"$f":"IF((C74-I74)<>0,IF(C74=N74,B74,IF(B74=H74,B74,IF(B74=\"\",\"PUR?\",\"MISMATCH!\"))),(IF(B74=H74,IF(B74=\"\",\"-\",B74),\"MISMATCH\")))","v":"-"},{"$f":"IF((C74-I74)<>0,C74-I74,\"-\")","v":"-"},{"$f":"IF(M74=\"MISMATCH!\",\"-\",IF(N74<0,\"PUR?\",D74))","v":"-"},{"$f":"IF(M74=\"MISMATCH!\",\"-\",IF(N74<>\"-\",IF(N74<0,\"PUR?\",N74*O74),\"-\"))","v":"-"},{"$f":"IF(M74=\"MISMATCH!\",\"-\",IF(AND(S74<=365,C74-I74>=0,S74<>\"Date?\",S74<>\"\"),IF(D74=J74,\"-\",IF(OR(I74=\"\",K74=\"\"),\"-\",I74*(J74-D74))),\"-\"))","v":"-"},{"$f":"IF(M74=\"MISMATCH!\",\"-\",IF(AND(S74>365,C74-I74>=0,S74<>\"Date?\",S74<>\"\"),IF(D74=J74,\"-\",IF(OR(I74=\"\",K74=\"\"),\"-\",I74*(J74-D74))),\"-\"))","v":"-"},{"$f":"IF(M74=\"MISMATCH!\",\"-\",IF(AND(A74<>\"\",G74<>\"\"),G74-A74+1,\"DATE?\"))","v":"DATE?"},{"$f":"IF(AND(N74<>\"-\",N74>0),IF(Q74<>\"-\",IF(A74=G74,\"Stk,Intra day\",\"Stk,STCG\"),IF(R74<>\"-\",\"Stk,LTCG\",IF(N74=\"-\",\"-\",\"Stk\"))),IF(N74<0,\"-ve Stk\",IF(Q74<>\"-\",IF(A74=G74,\"Intra day\",\"STCG\"),IF(R74<>\"-\",\"LTCG\",\"-\"))))","v":"-"}]
[null,null,null,{"$f":"IF(AND(E75<>0,C75<>0),E75/C75,IF(F75=\"Yes\",0,\"-\"))","v":"-"},null,null,null,null,null,{"$f":"IF(AND(K75<>0,I75<>0),K75/I75,\"-\")","v":"-"},null,{"$f":"IF(P75<>\"-\",A75,IF(F75=\"Yes\",IF(A75=\"\",\"-\",A75),\"-\"))","v":"-"},{"$f":"IF((C75-I75)<>0,IF(C75=N75,B75,IF(B75=H75,B75,IF(B75=\"\",\"PUR?\",\"MISMATCH!\"))),(IF(B75=H75,IF(B75=\"\",\"-\",B75),\"MISMATCH\")))","v":"-"},{"$f":"IF((C75-I75)<>0,C75-I75,\"-\")","v":"-"},{"$f":"IF(M75=\"MISMATCH!\",\"-\",IF(N75<0,\"PUR?\",D75))","v":"-"},{"$f":"IF(M75=\"MISMATCH!\",\"-\",IF(N75<>\"-\",IF(N75<0,\"PUR?\",N75*O75),\"-\"))","v":"-"},{"$f":"IF(M75=\"MISMATCH!\",\"-\",IF(AND(S75<=365,C75-I75>=0,S75<>\"Date?\",S75<>\"\"),IF(D75=J75,\"-\",IF(OR(I75=\"\",K75=\"\"),\"-\",I75*(J75-D75))),\"-\"))","v":"-"},{"$f":"IF(M75=\"MISMATCH!\",\"-\",IF(AND(S75>365,C75-I75>=0,S75<>\"Date?\",S75<>\"\"),IF(D75=J75,\"-\",IF(OR(I75=\"\",K75=\"\"),\"-\",I75*(J75-D75))),\"-\"))","v":"-"},{"$f":"IF(M75=\"MISMATCH!\",\"-\",IF(AND(A75<>\"\",G75<>\"\"),G75-A75+1,\"DATE?\"))","v":"DATE?"},{"$f":"IF(AND(N75<>\"-\",N75>0),IF(Q75<>\"-\",IF(A75=G75,\"Stk,Intra day\",\"Stk,STCG\"),IF(R75<>\"-\",\"Stk,LTCG\",IF(N75=\"-\",\"-\",\"Stk\"))),IF(N75<0,\"-ve Stk\",IF(Q75<>\"-\",IF(A75=G75,\"Intra day\",\"STCG\"),IF(R75<>\"-\",\"LTCG\",\"-\"))))","v":"-"}]
[null,null,null,{"$f":"IF(AND(E76<>0,C76<>0),E76/C76,IF(F76=\"Yes\",0,\"-\"))","v":"-"},null,null,null,null,null,{"$f":"IF(AND(K76<>0,I76<>0),K76/I76,\"-\")","v":"-"},null,{"$f":"IF(P76<>\"-\",A76,IF(F76=\"Yes\",IF(A76=\"\",\"-\",A76),\"-\"))","v":"-"},{"$f":"IF((C76-I76)<>0,IF(C76=N76,B76,IF(B76=H76,B76,IF(B76=\"\",\"PUR?\",\"MISMATCH!\"))),(IF(B76=H76,IF(B76=\"\",\"-\",B76),\"MISMATCH\")))","v":"-"},{"$f":"IF((C76-I76)<>0,C76-I76,\"-\")","v":"-"},{"$f":"IF(M76=\"MISMATCH!\",\"-\",IF(N76<0,\"PUR?\",D76))","v":"-"},{"$f":"IF(M76=\"MISMATCH!\",\"-\",IF(N76<>\"-\",IF(N76<0,\"PUR?\",N76*O76),\"-\"))","v":"-"},{"$f":"IF(M76=\"MISMATCH!\",\"-\",IF(AND(S76<=365,C76-I76>=0,S76<>\"Date?\",S76<>\"\"),IF(D76=J76,\"-\",IF(OR(I76=\"\",K76=\"\"),\"-\",I76*(J76-D76))),\"-\"))","v":"-"},{"$f":"IF(M76=\"MISMATCH!\",\"-\",IF(AND(S76>365,C76-I76>=0,S76<>\"Date?\",S76<>\"\"),IF(D76=J76,\"-\",IF(OR(I76=\"\",K76=\"\"),\"-\",I76*(J76-D76))),\"-\"))","v":"-"},{"$f":"IF(M76=\"MISMATCH!\",\"-\",IF(AND(A76<>\"\",G76<>\"\"),G76-A76+1,\"DATE?\"))","v":"DATE?"},{"$f":"IF(AND(N76<>\"-\",N76>0),IF(Q76<>\"-\",IF(A76=G76,\"Stk,Intra day\",\"Stk,STCG\"),IF(R76<>\"-\",\"Stk,LTCG\",IF(N76=\"-\",\"-\",\"Stk\"))),IF(N76<0,\"-ve Stk\",IF(Q76<>\"-\",IF(A76=G76,\"Intra day\",\"STCG\"),IF(R76<>\"-\",\"LTCG\",\"-\"))))","v":"-"}]
[null,null,null,"-",null,null,null,null,null,"-",null,"-","-","-","-","-","-","-","DATE?","-"]
[null,null,null,"-",null,null,null,null,null,"-",null,"-","-","-","-","-","-","-","DATE?","-"]
[null,null,null,"-",null,null,null,null,null,"-",null,"-","-","-","-","-","-","-","DATE?","-"]
[null,null,null,"-",null,null,null,null,null,"-",null,"-","-","-","-","-","-","-","DATE?","-"]
[null,null,null,"-",null,null,null,null,null,"-",null,"-","-","-","-","-","-","-","DATE?","-"]
[null,null,null,"-",null,null,null,null,null,"-",null,"-","-","-","-","-","-","-","DATE?","-"]
[null,null,null,{"$f":"IF(AND(E83<>0,C83<>0),E83/C83,IF(F83=\"Yes\",0,\"-\"))","v":"-"},null,null,null,null,null,{"$f":"IF(AND(K83<>0,I83<>0),K83/I83,\"-\")","v":"-"},null,{"$f":"IF(P83<>\"-\",A83,IF(F83=\"Yes\",IF(A83=\"\",\"-\",A83),\"-\"))","v":"-"},{"$f":"IF((C83-I83)<>0,IF(C83=N83,B83,IF(B83=H83,B83,IF(B83=\"\",\"PUR?\",\"MISMATCH!\"))),(IF(B83=H83,IF(B83=\"\",\"-\",B83),\"MISMATCH\")))","v":"-"},{"$f":"IF((C83-I83)<>0,C83-I83,\"-\")","v":"-"},{"$f":"IF(M83=\"MISMATCH!\",\"-\",IF(N83<0,\"PUR?\",D83))","v":"-"},{"$f":"IF(M83=\"MISMATCH!\",\"-\",IF(N83<>\"-\",IF(N83<0,\"PUR?\",N83*O83),\"-\"))","v":"-"},{"$f":"IF(M83=\"MISMATCH!\",\"-\",IF(AND(S83<=365,C83-I83>=0,S83<>\"Date?\",S83<>\"\"),IF(D83=J83,\"-\",IF(OR(I83=\"\",K83=\"\"),\"-\",I83*(J83-D83))),\"-\"))","v":"-"},{"$f":"IF(M83=\"MISMATCH!\",\"-\",IF(AND(S83>365,C83-I83>=0,S83<>\"Date?\",S83<>\"\"),IF(D83=J83,\"-\",IF(OR(I83=\"\",K83=\"\"),\"-\",I83*(J83-D83))),\"-\"))","v":"-"},{"$f":"IF(M83=\"MISMATCH!\",\"-\",IF(AND(A83<>\"\",G83<>\"\"),G83-A83+1,\"DATE?\"))","v":"DATE?"},{"$f":"IF(AND(N83<>\"-\",N83>0),IF(Q83<>\"-\",IF(A83=G83,\"Stk,Intra day\",\"Stk,STCG\"),IF(R83<>\"-\",\"Stk,LTCG\",IF(N83=\"-\",\"-\",\"Stk\"))),IF(N83<0,\"-ve Stk\",IF(Q83<>\"-\",IF(A83=G83,\"Intra day\",\"STCG\"),IF(R83<>\"-\",\"LTCG\",\"-\"))))","v":"-"}]
[null,null,null,"-",null,null,null,null,null,"-",null,"-","-","-","-","-","-","-","DATE?","-"]
[null,null,null,"-",null,null,null,null,null,"-",null,"-","-","-","-","-","-","-","DATE?","-"]
[null,null,null,"-",null,null,null,null,null,"-",null,"-","-","-","-","-","-","-","DATE?","-"]
[null,null,null,"-",null,null,null,null,null,"-",null,"-","-","-","-","-","-","-","DATE?","-"]
[null,null,null,"-",null,null,null,null,null,"-",null,"-","-","-","-","-","-","-","DATE?","-"]
[null,null,null,"-",null,null,null,null,null,"-",null,"-","-","-","-","-","-","-","DATE?","-"]
[null,null,null,"-",null,null,null,null,null,"-",null,"-","-","-","-","-","-","-","DATE?","-"]
[null,null,null,{"$f":"IF(AND(E91<>0,C91<>0),E91/C91,IF(F91=\"Yes\",0,\"-\"))","v":"-"},null,null,null,null,null,{"$f":"IF(AND(K91<>0,I91<>0),K91/I91,\"-\")","v":"-"},null,{"$f":"IF(P91<>\"-\",A91,IF(F91=\"Yes\",IF(A91=\"\",\"-\",A91),\"-\"))","v":"-"},{"$f":"IF((C91-I91)<>0,IF(C91=N91,B91,IF(B91=H91,B91,IF(B91=\"\",\"PUR?\",\"MISMATCH!\"))),(IF(B91=H91,IF(B91=\"\",\"-\",B91),\"MISMATCH\")))","v":"-"},{"$f":"IF((C91-I91)<>0,C91-I91,\"-\")","v":"-"},{"$f":"IF(M91=\"MISMATCH!\",\"-\",IF(N91<0,\"PUR?\",D91))","v":"-"},{"$f":"IF(M91=\"MISMATCH!\",\"-\",IF(N91<>\"-\",IF(N91<0,\"PUR?\",N91*O91),\"-\"))","v":"-"},{"$f":"IF(M91=\"MISMATCH!\",\"-\",IF(AND(S91<=365,C91-I91>=0,S91<>\"Date?\",S91<>\"\"),IF(D91=J91,\"-\",IF(OR(I91=\"\",K91=\"\"),\"-\",I91*(J91-D91))),\"-\"))","v":"-"},{"$f":"IF(M91=\"MISMATCH!\",\"-\",IF(AND(S91>365,C91-I91>=0,S91<>\"Date?\",S91<>\"\"),IF(D91=J91,\"-\",IF(OR(I91=\"\",K91=\"\"),\"-\",I91*(J91-D91))),\"-\"))","v":"-"},{"$f":"IF(M91=\"MISMATCH!\",\"-\",IF(AND(A91<>\"\",G91<>\"\"),G91-A91+1,\"DATE?\"))","v":"DATE?"},{"$f":"IF(AND(N91<>\"-\",N91>0),IF(Q91<>\"-\",IF(A91=G91,\"Stk,Intra day\",\"Stk,STCG\"),IF(R91<>\"-\",\"Stk,LTCG\",IF(N91=\"-\",\"-\",\"Stk\"))),IF(N91<0,\"-ve Stk\",IF(Q91<>\"-\",IF(A91=G91,\"Intra day\",\"STCG\"),IF(R91<>\"-\",\"LTCG\",\"-\"))))","v":"-"}]
[null,null,null,"-",null,null,null,null,null,"-",null,"-","-","-","-","-","-","-","DATE?","-"]
[null,null,null,{"$f":"IF(AND(E93<>0,C93<>0),E93/C93,IF(F93=\"Yes\",0,\"-\"))","v":"-"},null,null,null,null,null,{"$f":"IF(AND(K93<>0,I93<>0),K93/I93,\"-\")","v":"-"},null,{"$f":"IF(P93<>\"-\",A93,IF(F93=\"Yes\",IF(A93=\"\",\"-\",A93),\"-\"))","v":"-"},{"$f":"IF((C93-I93)<>0,IF(C93=N93,B93,IF(B93=H93,B93,IF(B93=\"\",\"PUR?\",\"MISMATCH!\"))),(IF(B93=H93,IF(B93=\"\",\"-\",B93),\"MISMATCH\")))","v":"-"},{"$f":"IF((C93-I93)<>0,C93-I93,\"-\")","v":"-"},{"$f":"IF(M93=\"MISMATCH!\",\"-\",IF(N93<0,\"PUR?\",D93))","v":"-"},{"$f":"IF(M93=\"MISMATCH!\",\"-\",IF(N93<>\"-\",IF(N93<0,\"PUR?\",N93*O93),\"-\"))","v":"-"},{"$f":"IF(M93=\"MISMATCH!\",\"-\",IF(AND(S93<=365,C93-I93>=0,S93<>\"Date?\",S93<>\"\"),IF(D93=J93,\"-\",IF(OR(I93=\"\",K93=\"\"),\"-\",I93*(J93-D93))),\"-\"))","v":"-"},{"$f":"IF(M93=\"MISMATCH!\",\"-\",IF(AND(S93>365,C93-I93>=0,S93<>\"Date?\",S93<>\"\"),IF(D93=J93,\"-\",IF(OR(I93=\"\",K93=\"\"),\"-\",I93*(J93-D93))),\"-\"))","v":"-"},{"$f":"IF(M93=\"MISMATCH!\",\"-\",IF(AND(A93<>\"\",G93<>\"\"),G93-A93+1,\"DATE?\"))","v":"DATE?"},{"$f":"IF(AND(N93<>\"-\",N93>0),IF(Q93<>\"-\",IF(A93=G93,\"Stk,Intra day\",\"Stk,STCG\"),IF(R93<>\"-\",\"Stk,LTCG\",IF(N93=\"-\",\"-\",\"Stk\"))),IF(N93<0,\"-ve Stk\",IF(Q93<>\"-\",IF(A93=G93,\"Intra day\",\"STCG\"),IF(R93<>\"-\",\"LTCG\",\"-\"))))","v":"-"}]
[null,null,null,"-",null,null,null,null,null,"-",null,"-","-","-","-","-","-","-","DATE?","-"]
[null,null,null,{"$f":"IF(AND(E95<>0,C95<>0),E95/C95,IF(F95=\"Yes\",0,\"-\"))","v":"-"},null,null,null,null,null,{"$f":"IF(AND(K95<>0,I95<>0),K95/I95,\"-\")","v":"-"},null,{"$f":"IF(P95<>\"-\",A95,IF(F95=\"Yes\",IF(A95=\"\",\"-\",A95),\"-\"))","v":"-"},{"$f":"IF((C95-I95)<>0,IF(C95=N95,B95,IF(B95=H95,B95,IF(B95=\"\",\"PUR?\",\"MISMATCH!\"))),(IF(B95=H95,IF(B95=\"\",\"-\",B95),\"MISMATCH\")))","v":"-"},{"$f":"IF((C95-I95)<>0,C95-I95,\"-\")","v":"-"},{"$f":"IF(M95=\"MISMATCH!\",\"-\",IF(N95<0,\"PUR?\",D95))","v":"-"},{"$f":"IF(M95=\"MISMATCH!\",\"-\",IF(N95<>\"-\",IF(N95<0,\"PUR?\",N95*O95),\"-\"))","v":"-"},{"$f":"IF(M95=\"MISMATCH!\",\"-\",IF(AND(S95<=365,C95-I95>=0,S95<>\"Date?\",S95<>\"\"),IF(D95=J95,\"-\",IF(OR(I95=\"\",K95=\"\"),\"-\",I95*(J95-D95))),\"-\"))","v":"-"},{"$f":"IF(M95=\"MISMATCH!\",\"-\",IF(AND(S95>365,C95-I95>=0,S95<>\"Date?\",S95<>\"\"),IF(D95=J95,\"-\",IF(OR(I95=\"\",K95=\"\"),\"-\",I95*(J95-D95))),\"-\"))","v":"-"},{"$f":"IF(M95=\"MISMATCH!\",\"-\",IF(AND(A95<>\"\",G95<>\"\"),G95-A95+1,\"DATE?\"))","v":"DATE?"},{"$f":"IF(AND(N95<>\"-\",N95>0),IF(Q95<>\"-\",IF(A95=G95,\"Stk,Intra day\",\"Stk,STCG\"),IF(R95<>\"-\",\"Stk,LTCG\",IF(N95=\"-\",\"-\",\"Stk\"))),IF(N95<0,\"-ve Stk\",IF(Q95<>\"-\",IF(A95=G95,\"Intra day\",\"STCG\"),IF(R95<>\"-\",\"LTCG\",\"-\"))))","v":"-"}]
[null,null,null,"-",null,null,null,null,null,"-",null,"-","-","-","-","-","-","-","DATE?","-"]
[null,null,null,"-",null,null,null,null,null,"-",null,"-","-","-","-","-","-","-","DATE?","-"]
[null,null,null,"-",null,null,null,null,null,"-",null,"-","-","-","-","-","-","-","DATE?","-"]
[null,null,null,"-",null,null,null,null,null,"-",null,"-","-","-","-","-","-","-","DATE?","-"]
[null,null,null,"-",null,null,null,null,null,"-",null,"-","-","-","-","-","-","-","DATE?","-"]
[null,null,null,"-",null,null,null,null,null,"-",null,"-","-","-","-","-","-","-","DATE?","-"]
[null,null,null,{"$f":"IF(AND(E102<>0,C102<>0),E102/C102,IF(F102=\"Yes\",0,\"-\"))","v":"-"},null,null,null,null,null,{"$f":"IF(AND(K102<>0,I102<>0),K102/I102,\"-\")","v":"-"},null,{"$f":"IF(P102<>\"-\",A102,IF(F102=\"Yes\",IF(A102=\"\",\"-\",A102),\"-\"))","v":"-"},{"$f":"IF((C102-I102)<>0,IF(C102=N102,B102,IF(B102=H102,B102,IF(B102=\"\",\"PUR?\",\"MISMATCH!\"))),(IF(B102=H102,IF(B102=\"\",\"-\",B102),\"MISMATCH\")))","v":"-"},{"$f":"IF((C102-I102)<>0,C102-I102,\"-\")","v":"-"},{"$f":"IF(M102=\"MISMATCH!\",\"-\",IF(N102<0,\"PUR?\",D102))","v":"-"},{"$f":"IF(M102=\"MISMATCH!\",\"-\",IF(N102<>\"-\",IF(N102<0,\"PUR?\",N102*O102),\"-\"))","v":"-"},{"$f":"IF(M102=\"MISMATCH!\",\"-\",IF(AND(S102<=365,C102-I102>=0,S102<>\"Date?\",S102<>\"\"),IF(D102=J102,\"-\",IF(OR(I102=\"\",K102=\"\"),\"-\",I102*(J102-D102))),\"-\"))","v":"-"},{"$f":"IF(M102=\"MISMATCH!\",\"-\",IF(AND(S102>365,C102-I102>=0,S102<>\"Date?\",S102<>\"\"),IF(D102=J102,\"-\",IF(OR(I102=\"\",K102=\"\"),\"-\",I102*(J102-D102))),\"-\"))","v":"-"},{"$f":"IF(M102=\"MISMATCH!\",\"-\",IF(AND(A102<>\"\",G102<>\"\"),G102-A102+1,\"DATE?\"))","v":"DATE?"},{"$f":"IF(AND(N102<>\"-\",N102>0),IF(Q102<>\"-\",IF(A102=G102,\"Stk,Intra day\",\"Stk,STCG\"),IF(R102<>\"-\",\"Stk,LTCG\",IF(N102=\"-\",\"-\",\"Stk\"))),IF(N102<0,\"-ve Stk\",IF(Q102<>\"-\",IF(A102=G102,\"Intra day\",\"STCG\"),IF(R102<>\"-\",\"LTCG\",\"-\"))))","v":"-"}]
[null,null,null,{"$f":"IF(AND(E103<>0,C103<>0),E103/C103,IF(F103=\"Yes\",0,\"-\"))","v":"-"},null,null,null,null,null,{"$f":"IF(AND(K103<>0,I103<>0),K103/I103,\"-\")","v":"-"},null,{"$f":"IF(P103<>\"-\",A103,IF(F103=\"Yes\",IF(A103=\"\",\"-\",A103),\"-\"))","v":"-"},{"$f":"IF((C103-I103)<>0,IF(C103=N103,B103,IF(B103=H103,B103,IF(B103=\"\",\"PUR?\",\"MISMATCH!\"))),(IF(B103=H103,IF(B103=\"\",\"-\",B103),\"MISMATCH\")))","v":"-"},{"$f":"IF((C103-I103)<>0,C103-I103,\"-\")","v":"-"},{"$f":"IF(M103=\"MISMATCH!\",\"-\",IF(N103<0,\"PUR?\",D103))","v":"-"},{"$f":"IF(M103=\"MISMATCH!\",\"-\",IF(N103<>\"-\",IF(N103<0,\"PUR?\",N103*O103),\"-\"))","v":"-"},{"$f":"IF(M103=\"MISMATCH!\",\"-\",IF(AND(S103<=365,C103-I103>=0,S103<>\"Date?\",S103<>\"\"),IF(D103=J103,\"-\",IF(OR(I103=\"\",K103=\"\"),\"-\",I103*(J103-D103))),\"-\"))","v":"-"},{"$f":"IF(M103=\"MISMATCH!\",\"-\",IF(AND(S103>365,C103-I103>=0,S103<>\"Date?\",S103<>\"\"),IF(D103=J103,\"-\",IF(OR(I103=\"\",K103=\"\"),\"-\",I103*(J103-D103))),\"-\"))","v":"-"},{"$f":"IF(M103=\"MISMATCH!\",\"-\",IF(AND(A103<>\"\",G103<>\"\"),G103-A103+1,\"DATE?\"))","v":"DATE?"},{"$f":"IF(AND(N103<>\"-\",N103>0),IF(Q103<>\"-\",IF(A103=G103,\"Stk,Intra day\",\"Stk,STCG\"),IF(R103<>\"-\",\"Stk,LTCG\",IF(N103=\"-\",\"-\",\"Stk\"))),IF(N103<0,\"-ve Stk\",IF(Q103<>\"-\",IF(A103=G103,\"Intra day\",\"STCG\"),IF(R103<>\"-\",\"LTCG\",\"-\"))))","v":"-"}]
[null,null,null,"-",null,null,null,null,null,"-",null,"-","-","-","-","-","-","-","DATE?","-"]
[null,null,null,"-",null,null,null,null,null,"-",null,"-","-","-","-","-","-","-","DATE?","-"]
[null,null,null,"-",null,null,null,null,null,"-",null,"-","-","-","-","-","-","-","DATE?","-"]
[null,null,null,"-",null,null,null,null,null,"-",null,"-","-","-","-","-","-","-","DATE?","-"]
[null,null,null,"-",null,null,null,null,null,"-",null,"-","-","-","-","-","-","-","DATE?","-"]
[null,null,null,"-",null,null,null,null,null,"-",null,"-","-","-","-","-","-","-","DATE?","-"]
[null,null,null,"-",null,null,null,null,null,"-",null,"-","-","-","-","-","-","-","DATE?","-"]
[null,null,null,"-",null,null,null,null,null,"-",null,"-","-","-","-","-","-","-","DATE?","-"]
[null,null,null,"-",null,null,null,null,null,"-",null,"-","-","-","-","-","-","-","DATE?","-"]
[null,null,null,"-",null,null,null,null,null,"-",null,"-","-","-","-","-","-","-","DATE?","-"]
[null,null,null,{"$f":"IF(AND(E114<>0,C114<>0),E114/C114,IF(F114=\"Yes\",0,\"-\"))","v":"-"},null,null,null,null,null,{"$f":"IF(AND(K114<>0,I114<>0),K114/I114,\"-\")","v":"-"},null,{"$f":"IF(P114<>\"-\",A114,IF(F114=\"Yes\",IF(A114=\"\",\"-\",A114),\"-\"))","v":"-"},{"$f":"IF((C114-I114)<>0,IF(C114=N114,B114,IF(B114=H114,B114,IF(B114=\"\",\"PUR?\",\"MISMATCH!\"))),(IF(B114=H114,IF(B114=\"\",\"-\",B114),\"MISMATCH\")))","v":"-"},{"$f":"IF((C114-I114)<>0,C114-I114,\"-\")","v":"-"},{"$f":"IF(M114=\"MISMATCH!\",\"-\",IF(N114<0,\"PUR?\",D114))","v":"-"},{"$f":"IF(M114=\"MISMATCH!\",\"-\",IF(N114<>\"-\",IF(N114<0,\"PUR?\",N114*O114),\"-\"))","v":"-"},{"$f":"IF(M114=\"MISMATCH!\",\"-\",IF(AND(S114<=365,C114-I114>=0,S114<>\"Date?\",S114<>\"\"),IF(D114=J114,\"-\",IF(OR(I114=\"\",K114=\"\"),\"-\",I114*(J114-D114))),\"-\"))","v":"-"},{"$f":"IF(M114=\"MISMATCH!\",\"-\",IF(AND(S114>365,C114-I114>=0,S114<>\"Date?\",S114<>\"\"),IF(D114=J114,\"-\",IF(OR(I114=\"\",K114=\"\"),\"-\",I114*(J114-D114))),\"-\"))","v":"-"},{"$f":"IF(M114=\"MISMATCH!\",\"-\",IF(AND(A114<>\"\",G114<>\"\"),G114-A114+1,\"DATE?\"))","v":"DATE?"},{"$f":"IF(AND(N114<>\"-\",N114>0),IF(Q114<>\"-\",IF(A114=G114,\"Stk,Intra day\",\"Stk,STCG\"),IF(R114<>\"-\",\"Stk,LTCG\",IF(N114=\"-\",\"-\",\"Stk\"))),IF(N114<0,\"-ve Stk\",IF(Q114<>\"-\",IF(A114=G114,\"Intra day\",\"STCG\"),IF(R114<>\"-\",\"LTCG\",\"-\"))))","v":"-"}]
[null,null,null,"-",null,null,null,null,null,"-",null,"-","-","-","-","-","-","-","DATE?","-"]
[null,null,null,"-",null,null,null,null,null,"-",null,"-","-","-","-","-","-","-","DATE?","-"]
[null,null,null,"-",null,null,null,null,null,"-",null,"-","-","-","-","-","-","-","DATE?","-"]
[null,null,null,"-",null,null,null,null,null,"-",null,"-","-","-","-","-","-","-","DATE?","-"]
[null,null,null,"-",null,null,null,null,null,"-",null,"-","-","-","-","-","-","-","DATE?","-"]
[null,null,null,"-",null,null,null,null,null,"-",null,"-","-","-","-","-","-","-","DATE?","-"]
[null,null,null,"-",null,null,null,null,null,"-",null,"-","-","-","-","-","-","-","DATE?","-"]
[null,null,null,"-",null,null,null,null,null,"-",null,"-","-","-","-","-","-","-","DATE?","-"]
[null,null,null,"-",null,null,null,null,null,"-",null,"-","-","-","-","-","-","-","DATE?","-"]
[null,null,null,"-",null,null,null,null,null,"-",null,"-","-","-","-","-","-","-","DATE?","-"]
[null,null,null,"-",null,null,null,null,null,"-",null,"-","-","-","-","-","-","-","DATE?","-"]
[null,null,null,"-",null,null,null,null,null,"-",null,"-","-","-","-","-","-","-","DATE?","-"]
[null,null,null,"-",null,null,null,null,null,"-",null,"-","-","-","-","-","-","-","DATE?","-"]
[null,null,null,"-",null,null,null,null,null,"-",null,"-","-","-","-","-","-","-","DATE?","-"]
[null,null,null,{"$f":"IF(AND(E129<>0,C129<>0),E129/C129,IF(F129=\"Yes\",0,\"-\"))","v":"-"},null,null,null,null,null,{"$f":"IF(AND(K129<>0,I129<>0),K129/I129,\"-\")","v":"-"},null,{"$f":"IF(P129<>\"-\",A129,IF(F129=\"Yes\",IF(A129=\"\",\"-\",A129),\"-\"))","v":"-"},{"$f":"IF((C129-I129)<>0,IF(C129=N129,B129,IF(B129=H129,B129,IF(B129=\"\",\"PUR?\",\"MISMATCH!\"))),(IF(B129=H129,IF(B129=\"\",\"-\",B129),\"MISMATCH\")))","v":"-"},{"$f":"IF((C129-I129)<>0,C129-I129,\"-\")","v":"-"},{"$f":"IF(M129=\"MISMATCH!\",\"-\",IF(N129<0,\"PUR?\",D129))","v":"-"},{"$f":"IF(M129=\"MISMATCH!\",\"-\",IF(N129<>\"-\",IF(N129<0,\"PUR?\",N129*O129),\"-\"))","v":"-"},{"$f":"IF(M129=\"MISMATCH!\",\"-\",IF(AND(S129<=365,C129-I129>=0,S129<>\"Date?\",S129<>\"\"),IF(D129=J129,\"-\",IF(OR(I129=\"\",K129=\"\"),\"-\",I129*(J129-D129))),\"-\"))","v":"-"},{"$f":"IF(M129=\"MISMATCH!\",\"-\",IF(AND(S129>365,C129-I129>=0,S129<>\"Date?\",S129<>\"\"),IF(D129=J129,\"-\",IF(OR(I129=\"\",K129=\"\"),\"-\",I129*(J129-D129))),\"-\"))","v":"-"},{"$f":"IF(M129=\"MISMATCH!\",\"-\",IF(AND(A129<>\"\",G129<>\"\"),G129-A129+1,\"DATE?\"))","v":"DATE?"},{"$f":"IF(AND(N129<>\"-\",N129>0),IF(Q129<>\"-\",IF(A129=G129,\"Stk,Intra day\",\"Stk,STCG\"),IF(R129<>\"-\",\"Stk,LTCG\",IF(N129=\"-\",\"-\",\"Stk\"))),IF(N129<0,\"-ve Stk\",IF(Q129<>\"-\",IF(A129=G129,\"Intra day\",\"STCG\"),IF(R129<>\"-\",\"LTCG\",\"-\"))))","v":"-"}]
[null,null,null,"-",null,null,null,null,null,"-",null,"-","-","-","-","-","-","-","DATE?","-"]
[null,null,null,"-",null,null,null,null,null,"-",null,"-","-","-","-","-","-","-","DATE?","-"]
[null,null,null,"-",null,null,null,null,null,"-",null,"-","-","-","-","-","-","-","DATE?","-"]
[null,null,null,"-",null,null,null,null,null,"-",null,"-","-","-","-","-","-","-","DATE?","-"]
[null,null,null,"-",null,null,null,null,null,"-",null,"-","-","-","-","-","-","-","DATE?","-"]
[null,null,null,"-",null,null,null,null,null,"-",null,"-","-","-","-","-","-","-","DATE?","-"]
[null,null,null,"-",null,null,null,null,null,"-",null,"-","-","-","-","-","-","-","DATE?","-"]
[null,null,null,"-",null,null,null,null,null,"-",null,"-","-","-","-","-","-","-","DATE?","-"]
[null,null,null,"-",null,null,null,null,null,"-",null,"-","-","-","-","-","-","-","DATE?","-"]
[null,null,null,"-",null,null,null,null,null,"-",null,"-","-","-","-","-","-","-","DATE?","-"]
[null,null,null,"-",null,null,null,null,null,"-",null,"-","-","-","-","-","-","-","DATE?","-"]
[null,null,null,"-",null,null,null,null,null,"-",null,"-","-","-","-","-","-","-","DATE?","-"]
[null,null,null,"-",null,null,null,null,null,"-",null,"-","-","-","-","-","-","-","DATE?","-"]
[null,null,null,"-",null,null,null,null,null,"-",null,"-","-","-","-","-","-","-","DATE?","-"]
[null,null,null,"-",null,null,null,null,null,"-",null,"-","-","-","-","-","-","-","DATE?","-"]
[null,null,null,"-",null,null,null,null,null,"-",null,"-","-","-","-","-","-","-","DATE?","-"]
[null,null,null,"-",null,null,null,null,null,"-",null,"-","-","-","-","-","-","-","DATE?","-"]
[null,null,null,"-",null,null,null,null,null,"-",null,"-","-","-","-","-","-","-","DATE?","-"]
[null,null,null,"-",null,null,null,null,null,"-",null,"-","-","-","-","-","-","-","DATE?","-"]
[null,null,null,"-",null,null,null,null,null,"-",null,"-","-","-","-","-","-","-","DATE?","-"]
[null,null,null,"-",null,null,null,null,null,"-",null,"-","-","-","-","-","-","-","DATE?","-"]
[null,null,null,"-",null,null,null,null,null,"-",null,"-","-","-","-","-","-","-","DATE?","-"]
[null,null,null,"-",null,null,null,null,null,"-",null,"-","-","-","-","-","-","-","DATE?","-"]
[null,null,null,"-",null,null,null,null,null,"-",null,"-","-","-","-","-","-","-","DATE?","-"]
[null,null,null,{"$f":"IF(AND(E154<>0,C154<>0),E154/C154,IF(F154=\"Yes\",0,\"-\"))","v":"-"},null,null,null,null,null,{"$f":"IF(AND(K154<>0,I154<>0),K154/I154,\"-\")","v":"-"},null,{"$f":"IF(P154<>\"-\",A154,IF(F154=\"Yes\",IF(A154=\"\",\"-\",A154),\"-\"))","v":"-"},{"$f":"IF((C154-I154)<>0,IF(C154=N154,B154,IF(B154=H154,B154,IF(B154=\"\",\"PUR?\",\"MISMATCH!\"))),(IF(B154=H154,IF(B154=\"\",\"-\",B154),\"MISMATCH\")))","v":"-"},{"$f":"IF((C154-I154)<>0,C154-I154,\"-\")","v":"-"},{"$f":"IF(M154=\"MISMATCH!\",\"-\",IF(N154<0,\"PUR?\",D154))","v":"-"},{"$f":"IF(M154=\"MISMATCH!\",\"-\",IF(N154<>\"-\",IF(N154<0,\"PUR?\",N154*O154),\"-\"))","v":"-"},{"$f":"IF(M154=\"MISMATCH!\",\"-\",IF(AND(S154<=365,C154-I154>=0,S154<>\"Date?\",S154<>\"\"),IF(D154=J154,\"-\",IF(OR(I154=\"\",K154=\"\"),\"-\",I154*(J154-D154))),\"-\"))","v":"-"},{"$f":"IF(M154=\"MISMATCH!\",\"-\",IF(AND(S154>365,C154-I154>=0,S154<>\"Date?\",S154<>\"\"),IF(D154=J154,\"-\",IF(OR(I154=\"\",K154=\"\"),\"-\",I154*(J154-D154))),\"-\"))","v":"-"},{"$f":"IF(M154=\"MISMATCH!\",\"-\",IF(AND(A154<>\"\",G154<>\"\"),G154-A154+1,\"DATE?\"))","v":"DATE?"},{"$f":"IF(AND(N154<>\"-\",N154>0),IF(Q154<>\"-\",IF(A154=G154,\"Stk,Intra day\",\"Stk,STCG\"),IF(R154<>\"-\",\"Stk,LTCG\",IF(N154=\"-\",\"-\",\"Stk\"))),IF(N154<0,\"-ve Stk\",IF(Q154<>\"-\",IF(A154=G154,\"Intra day\",\"STCG\"),IF(R154<>\"-\",\"LTCG\",\"-\"))))","v":"-"}]
[null,null,null,"-",null,null,null,null,null,"-",null,"-","-","-","-","-","-","-","DATE?","-"]
[null,null,null,"-",null,null,null,null,null,"-",null,"-","-","-","-","-","-","-","DATE?","-"]
[null,null,null,"-",null,null,null,null,null,"-",null,"-","-","-","-","-","-","-","DATE?","-"]
[null,null,null,"-",null,null,null,null,null,"-",null,"-","-","-","-","-","-","-","DATE?","-"]
[null,null,null,"-",null,null,null,null,null,"-",null,"-","-","-","-","-","-","-","DATE?","-"]
[null,null,null,"-",null,null,null,null,null,"-",null,"-","-","-","-","-","-","-","DATE?","-"]
[null,null,null,"-",null,null,null,null,null,"-",null,"-","-","-","-","-","-","-","DATE?","-"]
[null,null,null,"-",null,null,null,null,null,"-",null,"-","-","-","-","-","-","-","DATE?","-"]
[null,null,null,"-",null,null,null,null,null,"-",null,"-","-","-","-","-","-","-","DATE?","-"]
[null,null,null,"-",null,null,null,null,null,"-",null,"-","-","-","-","-","-","-","DATE?","-"]
[null,null,null,"-",null,null,null,null,null,"-",null,"-","-","-","-","-","-","-","DATE?","-"]
[null,null,null,"-",null,null,null,null,null,"-",null,"-","-","-","-","-","-","-","DATE?","-"]
[null,null,null,"-",null,null,null,null,null,"-",null,"-","-","-","-","-","-","-","DATE?","-"]
[null,null,null,"-",null,null,null,null,null,"-",null,"-","-","-","-","-","-","-","DATE?","-"]
[null,null,null,"-",null,null,null,null,null,"-",null,"-","-","-","-","-","-","-","DATE?","-"]
[null,null,null,"-",null,null,null,null,null,"-",null,"-","-","-","-","-","-","-","DATE?","-"]
[null,null,null,"-",null,null,null,null,null,"-",null,"-","-","-","-","-","-","-","DATE?","-"]
[null,null,null,"-",null,null,null,null,null,"-",null,"-","-","-","-","-","-","-","DATE?","-"]
[null,null,null,"-",null,null,null,null,null,"-",null,"-","-","-","-","-","-","-","DATE?","-"]
[null,null,null,"-",null,null,null,null,null,"-",null,"-","-","-","-","-","-","-","DATE?","-"]
[null,null,null,"-",null,null,null,null,null,"-",null,"-","-","-","-","-","-","-","DATE?","-"]
[null,null,null,"-",null,null,null,null,null,"-",null,"-","-","-","-","-","-","-","DATE?","-"]
[null,null,null,"-",null,null,null,null,null,"-",null,"-","-","-","-","-","-","-","DATE?","-"]
[null,null,null,"-",null,null,null,null,null,"-",null,"-","-","-","-","-","-","-","DATE?","-"]
[null,null,null,"-",null,null,null,null,null,"-",null,"-","-","-","-","-","-","-","DATE?","-"]
[null,null,null,"-",null,null,null,null,null,"-",null,"-","-","-","-","-","-","-","DATE?","-"]
[null,null,null,"-",null,null,null,null,null,"-",null,"-","-","-","-","-","-","-","DATE?","-"]
[null,null,null,"-",null,null,null,null,null,"-",null,"-","-","-","-","-","-","-","DATE?","-"]
[null,null,null,"-",null,null,null,null,null,"-",null,"-","-","-","-","-","-","-","DATE?","-"]
[null,null,null,"-",null,null,null,null,null,"-",null,"-","-","-","-","-","-","-","DATE?","-"]
[null,null,null,"-",null,null,null,null,null,"-",null,"-","-","-","-","-","-","-","DATE?","-"]
[null,null,null,"-",null,null,null,null,null,"-",null,"-","-","-","-","-","-","-","DATE?","-"]
[null,null,null,"-",null,null,null,null,null,"-",null,"-","-","-","-","-","-","-","DATE?","-"]
[null,null,null,"-",null,null,null,null,null,"-",null,"-","-","-","-","-","-","-","DATE?","-"]
[null,null,null,"-",null,null,null,null,null,"-",null,"-","-","-","-","-","-","-","DATE?","-"]
[null,null,null,"-",null,null,null,null,null,"-",null,"-","-","-","-","-","-","-","DATE?","-"]
[null,null,null,"-",null,null,null,null,null,"-",null,"-","-","-","-","-","-","-","DATE?","-"]
[null,null,null,"-",null,null,null,null,null,"-",null,"-","-","-","-","-","-","-","DATE?","-"]
[null,null,null,"-",null,null,null,null,null,"-",null,"-","-","-","-","-","-","-","DATE?","-"]
[null,null,null,"-",null,null,null,null,null,"-",null,"-","-","-","-","-","-","-","DATE?","-"]
[null,null,null,"-",null,null,null,null,null,"-",null,"-","-","-","-","-","-","-","DATE?","-"]
[null,null,null,"-",null,null,null,null,null,"-",null,"-","-","-","-","-","-","-","DATE?","-"]
[null,null,null,"-",null,null,null,null,null,"-",null,"-","-","-","-","-","-","-","DATE?","-"]
[null,null,null,"-",null,null,null,null,null,"-",null,"-","-","-","-","-","-","-","DATE?","-"]
[null,null,null,"-",null,null,null,null,null,"-",null,"-","-","-","-","-","-","-","DATE?","-"]
[null,null,null,"-",null,null,null,null,null,"-",null,"-","-","-","-","-","-","-","DATE?","-"]
[null,null,null,"-",null,null,null,null,null,"-",null,"-","-","-","-","-","-","-","DATE?","-"]
[null,null,null,"-",null,null,null,null,null,"-",null,"-","-","-","-","-","-","-","DATE?","-"]
[null,null,null,"-",null,null,null,null,null,"-",null,"-","-","-","-","-","-","-","DATE?","-"]
[null,null,null,"-",null,null,null,null,null,"-",null,"-","-","-","-","-","-","-","DATE?","-"]
[null,null,null,"-",null,null,null,null,null,"-",null,"-","-","-","-","-","-","-","DATE?","-"]
[null,null,null,"-",null,null,null,null,null,"-",null,"-","-","-","-","-","-","-","DATE?","-"]
[null,null,null,"-",null,null,null,null,null,"-",null,"-","-","-","-","-","-","-","DATE?","-"]
[null,null,null,"-",null,null,null,null,null,"-",null,"-","-","-","-","-","-","-","DATE?","-"]
[null,null,null,"-",null,null,null,null,null,"-",null,"-","-","-","-","-","-","-","DATE?","-"]
[null,null,null,"-",null,null,null,null,null,"-",null,"-","-","-","-","-","-","-","DATE?","-"]
[null,null,null,"-",null,null,null,null,null,"-",null,"-","-","-","-","-","-","-","DATE?","-"]
[null,null,null,"-",null,null,null,null,null,"-",null,"-","-","-","-","-","-","-","DATE?","-"]
[null,null,null,"-",null,null,null,null,null,"-",null,"-","-","-","-","-","-","-","DATE?","-"]
[null,null,null,"-",null,null,null,null,null,"-",null,"-","-","-","-","-","-","-","DATE?","-"]
[null,null,null,"-",null,null,null,null,null,"-",null,"-","-","-","-","-","-","-","DATE?","-"]
[null,null,null,"-",null,null,null,null,null,"-",null,"-","-","-","-","-","-","-","DATE?","-"]
[null,null,null,"-",null,null,null,null,null,"-",null,"-","-","-","-","-","-","-","DATE?","-"]
[null,null,null,{"$f":"IF(AND(E218<>0,C218<>0),E218/C218,IF(F218=\"Yes\",0,\"-\"))","v":"-"},null,null,null,null,null,{"$f":"IF(AND(K218<>0,I218<>0),K218/I218,\"-\")","v":"-"},null,{"$f":"IF(P218<>\"-\",A218,IF(F218=\"Yes\",IF(A218=\"\",\"-\",A218),\"-\"))","v":"-"},{"$f":"IF((C218-I218)<>0,IF(C218=N218,B218,IF(B218=H218,B218,IF(B218=\"\",\"PUR?\",\"MISMATCH!\"))),(IF(B218=H218,IF(B218=\"\",\"-\",B218),\"MISMATCH\")))","v":"-"},{"$f":"IF((C218-I218)<>0,C218-I218,\"-\")","v":"-"},{"$f":"IF(M218=\"MISMATCH!\",\"-\",IF(N218<0,\"PUR?\",D218))","v":"-"},{"$f":"IF(M218=\"MISMATCH!\",\"-\",IF(N218<>\"-\",IF(N218<0,\"PUR?\",N218*O218),\"-\"))","v":"-"},{"$f":"IF(M218=\"MISMATCH!\",\"-\",IF(AND(S218<=365,C218-I218>=0,S218<>\"Date?\",S218<>\"\"),IF(D218=J218,\"-\",IF(OR(I218=\"\",K218=\"\"),\"-\",I218*(J218-D218))),\"-\"))","v":"-"},{"$f":"IF(M218=\"MISMATCH!\",\"-\",IF(AND(S218>365,C218-I218>=0,S218<>\"Date?\",S218<>\"\"),IF(D218=J218,\"-\",IF(OR(I218=\"\",K218=\"\"),\"-\",I218*(J218-D218))),\"-\"))","v":"-"},{"$f":"IF(M218=\"MISMATCH!\",\"-\",IF(AND(A218<>\"\",G218<>\"\"),G218-A218+1,\"DATE?\"))","v":"DATE?"},{"$f":"IF(AND(N218<>\"-\",N218>0),IF(Q218<>\"-\",IF(A218=G218,\"Stk,Intra day\",\"Stk,STCG\"),IF(R218<>\"-\",\"Stk,LTCG\",IF(N218=\"-\",\"-\",\"Stk\"))),IF(N218<0,\"-ve Stk\",IF(Q218<>\"-\",IF(A218=G218,\"Intra day\",\"STCG\"),IF(R218<>\"-\",\"LTCG\",\"-\"))))","v":"-"}]
[null,null,null,"-",null,null,null,null,null,"-",null,"-","-","-","-","-","-","-","DATE?","-"]
[null,null,null,"-",null,null,null,null,null,"-",null,"-","-","-","-","-","-","-","DATE?","-"]
[null,null,null,"-",null,null,null,null,null,"-",null,"-","-","-","-","-","-","-","DATE?","-"]
[null,null,null,"-",null,null,null,null,null,"-",null,"-","-","-","-","-","-","-","DATE?","-"]
[null,null,null,"-",null,null,null,null,null,"-",null,"-","-","-","-","-","-","-","DATE?","-"]
[null,null,null,"-",null,null,null,null,null,"-",null,"-","-","-","-","-","-","-","DATE?","-"]
[null,null,null,"-",null,null,null,null,null,"-",null,"-","-","-","-","-","-","-","DATE?","-"]
[null,null,null,"-",null,null,null,null,null,"-",null,"-","-","-","-","-","-","-","DATE?","-"]
[null,null,null,"-",null,null,null,null,null,"-",null,"-","-","-","-","-","-","-","DATE?","-"]
[null,null,null,"-",null,null,null,null,null,"-",null,"-","-","-","-","-","-","-","DATE?","-"]
[null,null,null,"-",null,null,null,null,null,"-",null,"-","-","-","-","-","-","-","DATE?","-"]
[null,null,null,"-",null,null,null,null,null,"-",null,"-","-","-","-","-","-","-","DATE?","-"]
[null,null,null,"-",null,null,null,null,null,"-",null,"-","-","-","-","-","-","-","DATE?","-"]
[null,null,null,"-",null,null,null,null,null,"-",null,"-","-","-","-","-","-","-","DATE?","-"]
[null,null,null,"-",null,null,null,null,null,"-",null,"-","-","-","-","-","-","-","DATE?","-"]
[null,null,null,"-",null,null,null,null,null,"-",null,"-","-","-","-","-","-","-","DATE?","-"]
[null,null,null,"-",null,null,null,null,null,"-",null,"-","-","-","-","-","-","-","DATE?","-"]
[null,null,null,"-",null,null,null,null,null,"-",null,"-","-","-","-","-","-","-","DATE?","-"]
[null,null,null,"-",null,null,null,null,null,"-",null,"-","-","-","-","-","-","-","DATE?","-"]
[null,null,null,"-",null,null,null,null,null,"-",null,"-","-","-","-","-","-","-","DATE?","-"]
[null,null,null,"-",null,null,null,null,null,"-",null,"-","-","-","-","-","-","-","DATE?","-"]
[null,null,null,"-",null,null,null,null,null,"-",null,"-","-","-","-","-","-","-","DATE?","-"]
[null,null,null,"-",null,null,null,null,null,"-",null,"-","-","-","-","-","-","-","DATE?","-"]
[null,null,null,"-",null,null,null,null,null,"-",null,"-","-","-","-","-","-","-","DATE?","-"]
[null,null,null,"-",null,null,null,null,null,"-",null,"-","-","-","-","-","-","-","DATE?","-"]
[null,null,null,"-",null,null,null,null,null,"-",null,"-","-","-","-","-","-","-","DATE?","-"]
[null,null,null,"-",null,null,null,null,null,"-",null,"-","-","-","-","-","-","-","DATE?","-"]
[null,null,null,"-",null,null,null,null,null,"-",null,"-","-","-","-","-","-","-","DATE?","-"]
[null,null,null,"-",null,null,null,null,null,"-",null,"-","-","-","-","-","-","-","DATE?","-"]
[null,null,null,"-",null,null,null,null,null,"-",null,"-","-","-","-","-","-","-","DATE?","-"]
[null,null,null,"-",null,null,null,null,null,"-",null,"-","-","-","-","-","-","-","DATE?","-"]
[null,null,null,"-",null,null,null,null,null,"-",null,"-","-","-","-","-","-","-","DATE?","-"]
[null,null,null,"-",null,null,null,null,null,"-",null,"-","-","-","-","-","-","-","DATE?","-"]
[null,null,null,"-",null,null,null,null,null,"-",null,"-","-","-","-","-","-","-","DATE?","-"]
[null,null,null,"-",null,null,null,null,null,"-",null,"-","-","-","-","-","-","-","DATE?","-"]
[null,null,null,"-",null,null,null,null,null,"-",null,"-","-","-","-","-","-","-","DATE?","-"]
[null,null,null,"-",null,null,null,null,null,"-",null,"-","-","-","-","-","-","-","DATE?","-"]
[null,null,null,"-",null,null,null,null,null,"-",null,"-","-","-","-","-","-","-","DATE?","-"]
[null,null,null,"-",null,null,null,null,null,"-",null,"-","-","-","-","-","-","-","DATE?","-"]
[null,null,null,"-",null,null,null,null,null,"-",null,"-","-","-","-","-","-","-","DATE?","-"]
[null,null,null,"-",null,null,null,null,null,"-",null,"-","-","-","-","-","-","-","DATE?","-"]
[null,null,null,"-",null,null,null,null,null,"-",null,"-","-","-","-","-","-","-","DATE?","-"]
[null,null,null,"-",null,null,null,null,null,"-",null,"-","-","-","-","-","-","-","DATE?","-"]
[null,null,null,"-",null,null,null,null,null,"-",null,"-","-","-","-","-","-","-","DATE?","-"]
[null,null,null,"-",null,null,null,null,null,"-",null,"-","-","-","-","-","-","-","DATE?","-"]
[null,null,null,"-",null,null,null,null,null,"-",null,"-","-","-","-","-","-","-","DATE?","-"]
[null,null,null,"-",null,null,null,null,null,"-",null,"-","-","-","-","-","-","-","DATE?","-"]
[null,null,null,"-",null,null,null,null,null,"-",null,"-","-","-","-","-","-","-","DATE?","-"]
[null,null,null,"-",null,null,null,null,null,"-",null,"-","-","-","-","-","-","-","DATE?","-"]
[null,null,null,"-",null,null,null,null,null,"-",null,"-","-","-","-","-","-","-","DATE?","-"]
[null,null,null,"-",null,null,null,null,null,"-",null,"-","-","-","-","-","-","-","DATE?","-"]
[null,null,null,"-",null,null,null,null,null,"-",null,"-","-","-","-","-","-","-","DATE?","-"]
[null,null,null,"-",null,null,null,null,null,"-",null,"-","-","-","-","-","-","-","DATE?","-"]
[null,null,null,"-",null,null,null,null,null,"-",null,"-","-","-","-","-","-","-","DATE?","-"]
[null,null,null,"-",null,null,null,null,null,"-",null,"-","-","-","-","-","-","-","DATE?","-"]
[null,null,null,"-",null,null,null,null,null,"-",null,"-","-","-","-","-","-","-","DATE?","-"]
[null,null,null,"-",null,null,null,null,null,"-",null,"-","-","-","-","-","-","-","DATE?","-"]
[null,null,null,"-",null,null,null,null,null,"-",null,"-","-","-","-","-","-","-","DATE?","-"]
[null,null,null,"-",null,null,null,null,null,"-",null,"-","-","-","-","-","-","-","DATE?","-"]
[null,null,null,"-",null,null,null,null,null,"-",null,"-","-","-","-","-","-","-","DATE?","-"]
[null,null,null,"-",null,null,null,null,null,"-",null,"-","-","-","-","-","-","-","DATE?","-"]
[null,null,null,"-",null,null,null,null,null,"-",null,"-","-","-","-","-","-","-","DATE?","-"]
[null,null,null,{"$f":"IF(AND(E281<>0,C281<>0),E281/C281,IF(F281=\"Yes\",0,\"-\"))","v":"-"},null,null,null,null,null,{"$f":"IF(AND(K281<>0,I281<>0),K281/I281,\"-\")","v":"-"},null,{"$f":"IF(P281<>\"-\",A281,IF(F281=\"Yes\",IF(A281=\"\",\"-\",A281),\"-\"))","v":"-"},{"$f":"IF((C281-I281)<>0,IF(C281=N281,B281,IF(B281=H281,B281,IF(B281=\"\",\"PUR?\",\"MISMATCH!\"))),(IF(B281=H281,IF(B281=\"\",\"-\",B281),\"MISMATCH\")))","v":"-"},{"$f":"IF((C281-I281)<>0,C281-I281,\"-\")","v":"-"},{"$f":"IF(M281=\"MISMATCH!\",\"-\",IF(N281<0,\"PUR?\",D281))","v":"-"},{"$f":"IF(M281=\"MISMATCH!\",\"-\",IF(N281<>\"-\",IF(N281<0,\"PUR?\",N281*O281),\"-\"))","v":"-"},{"$f":"IF(M281=\"MISMATCH!\",\"-\",IF(AND(S281<=365,C281-I281>=0,S281<>\"Date?\",S281<>\"\"),IF(D281=J281,\"-\",IF(OR(I281=\"\",K281=\"\"),\"-\",I281*(J281-D281))),\"-\"))","v":"-"},{"$f":"IF(M281=\"MISMATCH!\",\"-\",IF(AND(S281>365,C281-I281>=0,S281<>\"Date?\",S281<>\"\"),IF(D281=J281,\"-\",IF(OR(I281=\"\",K281=\"\"),\"-\",I281*(J281-D281))),\"-\"))","v":"-"},{"$f":"IF(M281=\"MISMATCH!\",\"-\",IF(AND(A281<>\"\",G281<>\"\"),G281-A281+1,\"DATE?\"))","v":"DATE?"},{"$f":"IF(AND(N281<>\"-\",N281>0),IF(Q281<>\"-\",IF(A281=G281,\"Stk,Intra day\",\"Stk,STCG\"),IF(R281<>\"-\",\"Stk,LTCG\",IF(N281=\"-\",\"-\",\"Stk\"))),IF(N281<0,\"-ve Stk\",IF(Q281<>\"-\",IF(A281=G281,\"Intra day\",\"STCG\"),IF(R281<>\"-\",\"LTCG\",\"-\"))))","v":"-"}]
[null,null,null,"-",null,null,null,null,null,"-",null,"-","-","-","-","-","-","-","DATE?","-"]
[null,null,null,"-",null,null,null,null,null,"-",null,"-","-","-","-","-","-","-","DATE?","-"]
[null,null,null,"-",null,null,null,null,null,"-",null,"-","-","-","-","-","-","-","DATE?","-"]
[null,null,null,"-",null,null,null,null,null,"-",null,"-","-","-","-","-","-","-","DATE?","-"]
[null,null,null,"-",null,null,null,null,null,"-",null,"-","-","-","-","-","-","-","DATE?","-"]
[null,null,null,"-",null,null,null,null,null,"-",null,"-","-","-","-","-","-","-","DATE?","-"]
[null,null,null,"-",null,null,null,null,null,"-",null,"-","-","-","-","-","-","-","DATE?","-"]
[null,null,null,"-",null,null,null,null,null,"-",null,"-","-","-","-","-","-","-","DATE?","-"]
[null,null,null,"-",null,null,null,null,null,"-",null,"-","-","-","-","-","-","-","DATE?","-"]
[null,null,null,"-",null,null,null,null,null,"-",null,"-","-","-","-","-","-","-","DATE?","-"]
[null,null,null,"-",null,null,null,null,null,"-",null,"-","-","-","-","-","-","-","DATE?","-"]
[null,null,null,"-",null,null,null,null,null,"-",null,"-","-","-","-","-","-","-","DATE?","-"]
[null,null,null,"-",null,null,null,null,null,"-",null,"-","-","-","-","-","-","-","DATE?","-"]
[null,null,null,"-",null,null,null,null,null,"-",null,"-","-","-","-","-","-","-","DATE?","-"]
[null,null,null,"-",null,null,null,null,null,"-",null,"-","-","-","-","-","-","-","DATE?","-"]
[null,null,null,"-",null,null,null,null,null,"-",null,"-","-","-","-","-","-","-","DATE?","-"]
[null,null,null,"-",null,null,null,null,null,"-",null,"-","-","-","-","-","-","-","DATE?","-"]
[null,null,null,"-",null,null,null,null,null,"-",null,"-","-","-","-","-","-","-","DATE?","-"]
[null,null,null,"-",null,null,null,null,null,"-",null,"-","-","-","-","-","-","-","DATE?","-"]
[null,null,null,"-",null,null,null,null,null,"-",null,"-","-","-","-","-","-","-","DATE?","-"]
[null,null,null,{"$f":"IF(AND(E302<>0,C302<>0),E302/C302,IF(F302=\"Yes\",0,\"-\"))","v":"-"},null,null,null,null,null,{"$f":"IF(AND(K302<>0,I302<>0),K302/I302,\"-\")","v":"-"},null,{"$f":"IF(P302<>\"-\",A302,IF(F302=\"Yes\",IF(A302=\"\",\"-\",A302),\"-\"))","v":"-"},{"$f":"IF((C302-I302)<>0,IF(C302=N302,B302,IF(B302=H302,B302,IF(B302=\"\",\"PUR?\",\"MISMATCH!\"))),(IF(B302=H302,IF(B302=\"\",\"-\",B302),\"MISMATCH\")))","v":"-"},{"$f":"IF((C302-I302)<>0,C302-I302,\"-\")","v":"-"},{"$f":"IF(M302=\"MISMATCH!\",\"-\",IF(N302<0,\"PUR?\",D302))","v":"-"},{"$f":"IF(M302=\"MISMATCH!\",\"-\",IF(N302<>\"-\",IF(N302<0,\"PUR?\",N302*O302),\"-\"))","v":"-"},{"$f":"IF(M302=\"MISMATCH!\",\"-\",IF(AND(S302<=365,C302-I302>=0,S302<>\"Date?\",S302<>\"\"),IF(D302=J302,\"-\",IF(OR(I302=\"\",K302=\"\"),\"-\",I302*(J302-D302))),\"-\"))","v":"-"},{"$f":"IF(M302=\"MISMATCH!\",\"-\",IF(AND(S302>365,C302-I302>=0,S302<>\"Date?\",S302<>\"\"),IF(D302=J302,\"-\",IF(OR(I302=\"\",K302=\"\"),\"-\",I302*(J302-D302))),\"-\"))","v":"-"},{"$f":"IF(M302=\"MISMATCH!\",\"-\",IF(AND(A302<>\"\",G302<>\"\"),G302-A302+1,\"DATE?\"))","v":"DATE?"},{"$f":"IF(AND(N302<>\"-\",N302>0),IF(Q302<>\"-\",IF(A302=G302,\"Stk,Intra day\",\"Stk,STCG\"),IF(R302<>\"-\",\"Stk,LTCG\",IF(N302=\"-\",\"-\",\"Stk\"))),IF(N302<0,\"-ve Stk\",IF(Q302<>\"-\",IF(A302=G302,\"Intra day\",\"STCG\"),IF(R302<>\"-\",\"LTCG\",\"-\"))))","v":"-"}]
[null,null,null,{"$f":"IF(AND(E303<>0,C303<>0),E303/C303,IF(F303=\"Yes\",0,\"-\"))","v":"-"},null,null,null,null,null,{"$f":"IF(AND(K303<>0,I303<>0),K303/I303,\"-\")","v":"-"},null,{"$f":"IF(P303<>\"-\",A303,IF(F303=\"Yes\",IF(A303=\"\",\"-\",A303),\"-\"))","v":"-"},{"$f":"IF((C303-I303)<>0,IF(C303=N303,B303,IF(B303=H303,B303,IF(B303=\"\",\"PUR?\",\"MISMATCH!\"))),(IF(B303=H303,IF(B303=\"\",\"-\",B303),\"MISMATCH\")))","v":"-"},{"$f":"IF((C303-I303)<>0,C303-I303,\"-\")","v":"-"},{"$f":"IF(M303=\"MISMATCH!\",\"-\",IF(N303<0,\"PUR?\",D303))","v":"-"},{"$f":"IF(M303=\"MISMATCH!\",\"-\",IF(N303<>\"-\",IF(N303<0,\"PUR?\",N303*O303),\"-\"))","v":"-"},{"$f":"IF(M303=\"MISMATCH!\",\"-\",IF(AND(S303<=365,C303-I303>=0,S303<>\"Date?\",S303<>\"\"),IF(D303=J303,\"-\",IF(OR(I303=\"\",K303=\"\"),\"-\",I303*(J303-D303))),\"-\"))","v":"-"},{"$f":"IF(M303=\"MISMATCH!\",\"-\",IF(AND(S303>365,C303-I303>=0,S303<>\"Date?\",S303<>\"\"),IF(D303=J303,\"-\",IF(OR(I303=\"\",K303=\"\"),\"-\",I303*(J303-D303))),\"-\"))","v":"-"},{"$f":"IF(M303=\"MISMATCH!\",\"-\",IF(AND(A303<>\"\",G303<>\"\"),G303-A303+1,\"DATE?\"))","v":"DATE?"},{"$f":"IF(AND(N303<>\"-\",N303>0),IF(Q303<>\"-\",IF(A303=G303,\"Stk,Intra day\",\"Stk,STCG\"),IF(R303<>\"-\",\"Stk,LTCG\",IF(N303=\"-\",\"-\",\"Stk\"))),IF(N303<0,\"-ve Stk\",IF(Q303<>\"-\",IF(A303=G303,\"Intra day\",\"STCG\"),IF(R303<>\"-\",\"LTCG\",\"-\"))))","v":"-"}]
[null,null,null,{"$f":"IF(AND(E304<>0,C304<>0),E304/C304,IF(F304=\"Yes\",0,\"-\"))","v":"-"},null,null,null,null,null,{"$f":"IF(AND(K304<>0,I304<>0),K304/I304,\"-\")","v":"-"},null,{"$f":"IF(P304<>\"-\",A304,IF(F304=\"Yes\",IF(A304=\"\",\"-\",A304),\"-\"))","v":"-"},{"$f":"IF((C304-I304)<>0,IF(C304=N304,B304,IF(B304=H304,B304,IF(B304=\"\",\"PUR?\",\"MISMATCH!\"))),(IF(B304=H304,IF(B304=\"\",\"-\",B304),\"MISMATCH\")))","v":"-"},{"$f":"IF((C304-I304)<>0,C304-I304,\"-\")","v":"-"},{"$f":"IF(M304=\"MISMATCH!\",\"-\",IF(N304<0,\"PUR?\",D304))","v":"-"},{"$f":"IF(M304=\"MISMATCH!\",\"-\",IF(N304<>\"-\",IF(N304<0,\"PUR?\",N304*O304),\"-\"))","v":"-"},{"$f":"IF(M304=\"MISMATCH!\",\"-\",IF(AND(S304<=365,C304-I304>=0,S304<>\"Date?\",S304<>\"\"),IF(D304=J304,\"-\",IF(OR(I304=\"\",K304=\"\"),\"-\",I304*(J304-D304))),\"-\"))","v":"-"},{"$f":"IF(M304=\"MISMATCH!\",\"-\",IF(AND(S304>365,C304-I304>=0,S304<>\"Date?\",S304<>\"\"),IF(D304=J304,\"-\",IF(OR(I304=\"\",K304=\"\"),\"-\",I304*(J304-D304))),\"-\"))","v":"-"},{"$f":"IF(M304=\"MISMATCH!\",\"-\",IF(AND(A304<>\"\",G304<>\"\"),G304-A304+1,\"DATE?\"))","v":"DATE?"},{"$f":"IF(AND(N304<>\"-\",N304>0),IF(Q304<>\"-\",IF(A304=G304,\"Stk,Intra day\",\"Stk,STCG\"),IF(R304<>\"-\",\"Stk,LTCG\",IF(N304=\"-\",\"-\",\"Stk\"))),IF(N304<0,\"-ve Stk\",IF(Q304<>\"-\",IF(A304=G304,\"Intra day\",\"STCG\"),IF(R304<>\"-\",\"LTCG\",\"-\"))))","v":"-"}]
[null,null,null,{"$f":"IF(AND(E305<>0,C305<>0),E305/C305,IF(F305=\"Yes\",0,\"-\"))","v":"-"},null,null,null,null,null,{"$f":"IF(AND(K305<>0,I305<>0),K305/I305,\"-\")","v":"-"},null,{"$f":"IF(P305<>\"-\",A305,IF(F305=\"Yes\",IF(A305=\"\",\"-\",A305),\"-\"))","v":"-"},{"$f":"IF((C305-I305)<>0,IF(C305=N305,B305,IF(B305=H305,B305,IF(B305=\"\",\"PUR?\",\"MISMATCH!\"))),(IF(B305=H305,IF(B305=\"\",\"-\",B305),\"MISMATCH\")))","v":"-"},{"$f":"IF((C305-I305)<>0,C305-I305,\"-\")","v":"-"},{"$f":"IF(M305=\"MISMATCH!\",\"-\",IF(N305<0,\"PUR?\",D305))","v":"-"},{"$f":"IF(M305=\"MISMATCH!\",\"-\",IF(N305<>\"-\",IF(N305<0,\"PUR?\",N305*O305),\"-\"))","v":"-"},{"$f":"IF(M305=\"MISMATCH!\",\"-\",IF(AND(S305<=365,C305-I305>=0,S305<>\"Date?\",S305<>\"\"),IF(D305=J305,\"-\",IF(OR(I305=\"\",K305=\"\"),\"-\",I305*(J305-D305))),\"-\"))","v":"-"},{"$f":"IF(M305=\"MISMATCH!\",\"-\",IF(AND(S305>365,C305-I305>=0,S305<>\"Date?\",S305<>\"\"),IF(D305=J305,\"-\",IF(OR(I305=\"\",K305=\"\"),\"-\",I305*(J305-D305))),\"-\"))","v":"-"},{"$f":"IF(M305=\"MISMATCH!\",\"-\",IF(AND(A305<>\"\",G305<>\"\"),G305-A305+1,\"DATE?\"))","v":"DATE?"},{"$f":"IF(AND(N305<>\"-\",N305>0),IF(Q305<>\"-\",IF(A305=G305,\"Stk,Intra day\",\"Stk,STCG\"),IF(R305<>\"-\",\"Stk,LTCG\",IF(N305=\"-\",\"-\",\"Stk\"))),IF(N305<0,\"-ve Stk\",IF(Q305<>\"-\",IF(A305=G305,\"Intra day\",\"STCG\"),IF(R305<>\"-\",\"LTCG\",\"-\"))))","v":"-"}]
[null,null,null,{"$f":"IF(AND(E306<>0,C306<>0),E306/C306,IF(F306=\"Yes\",0,\"-\"))","v":"-"},null,null,null,null,null,{"$f":"IF(AND(K306<>0,I306<>0),K306/I306,\"-\")","v":"-"},null,{"$f":"IF(P306<>\"-\",A306,IF(F306=\"Yes\",IF(A306=\"\",\"-\",A306),\"-\"))","v":"-"},{"$f":"IF((C306-I306)<>0,IF(C306=N306,B306,IF(B306=H306,B306,IF(B306=\"\",\"PUR?\",\"MISMATCH!\"))),(IF(B306=H306,IF(B306=\"\",\"-\",B306),\"MISMATCH\")))","v":"-"},{"$f":"IF((C306-I306)<>0,C306-I306,\"-\")","v":"-"},{"$f":"IF(M306=\"MISMATCH!\",\"-\",IF(N306<0,\"PUR?\",D306))","v":"-"},{"$f":"IF(M306=\"MISMATCH!\",\"-\",IF(N306<>\"-\",IF(N306<0,\"PUR?\",N306*O306),\"-\"))","v":"-"},{"$f":"IF(M306=\"MISMATCH!\",\"-\",IF(AND(S306<=365,C306-I306>=0,S306<>\"Date?\",S306<>\"\"),IF(D306=J306,\"-\",IF(OR(I306=\"\",K306=\"\"),\"-\",I306*(J306-D306))),\"-\"))","v":"-"},{"$f":"IF(M306=\"MISMATCH!\",\"-\",IF(AND(S306>365,C306-I306>=0,S306<>\"Date?\",S306<>\"\"),IF(D306=J306,\"-\",IF(OR(I306=\"\",K306=\"\"),\"-\",I306*(J306-D306))),\"-\"))","v":"-"},{"$f":"IF(M306=\"MISMATCH!\",\"-\",IF(AND(A306<>\"\",G306<>\"\"),G306-A306+1,\"DATE?\"))","v":"DATE?"},{"$f":"IF(AND(N306<>\"-\",N306>0),IF(Q306<>\"-\",IF(A306=G306,\"Stk,Intra day\",\"Stk,STCG\"),IF(R306<>\"-\",\"Stk,LTCG\",IF(N306=\"-\",\"-\",\"Stk\"))),IF(N306<0,\"-ve Stk\",IF(Q306<>\"-\",IF(A306=G306,\"Intra day\",\"STCG\"),IF(R306<>\"-\",\"LTCG\",\"-\"))))","v":"-"}]
[null,null,null,"-",null,null,null,null,null,"-",null,"-","-","-","-","-","-","-","DATE?","-"]
[null,null,null,"-",null,null,null,null,null,"-",null,"-","-","-","-","-","-","-","DATE?","-"]
[null,null,null,"-",null,null,null,null,null,"-",null,"-","-","-","-","-","-","-","DATE?","-"]
[]
[null,null,{"$f":"SUBTOTAL(9,C5:C309)","v":0},null,{"$f":"SUBTOTAL(9,E5:E309)","v":0},null,null,null,{"$f":"SUBTOTAL(9,I5:I309)","v":0},null,{"$f":"SUBTOTAL(9,K5:K309)","v":0},null,null,{"$f":"SUBTOTAL(9,N5:N309)","v":0},null,{"$f":"SUBTOTAL(9,P5:P309)","v":0},{"$f":"SUBTOTAL(9,Q5:Q309)","v":0},{"$f":"SUBTOTAL(9,R5:R309)","v":0}]

{"sheet":"Sheet2","index":1,"n_rows":33,"n_cols":6,"rows_kept":33,"cut":false,"hidden":false,"merged":[[0,0,0,5],[21,0,21,5],[2,0,2,5],[1,0,1,5],[19,0,19,5],[20,0,20,5]]}
["A.Y.2010-11"]
[]
["Broker account"]
["To","Balance b/f",null,"By","Balance b/f"]
["To","Sales",null,"By","Purchases"]
[]
["To","Dividend",null,"By","AMC charges"]
["To","Bank ( payment)",null,"By","Bank ( receipts )"]
["To",null,null,"By"]
["To",null,null,"By"]
["To",null,null,"By"]
["To",null,null,"By"]
["To",null,null,"By"]
["To",null,null,"By"]
["To","Balance c/f",null,"By","Balance c/f"]
[]
[null,null,{"$f":"SUM(C4:C15)","v":0},null,{"$f":"C17-F17","v":0},{"$f":"SUM(F4:F15)","v":0}]
[]
[]
["A.Y.2010-11"]
[]
["Shares & Securities account"]
["To","Balance B/d",null,"By","Sales"]
["To","Purchase",null,"By","Stock Written Off"]
["To"," STCG",null,"By"]
["To",null,null,"By","LTCL"]
["To","Speculation Gain",null,"By"]
["To","Claris Life sciences",null,"By"]
["To",null,null,"By"]
["To",null,null,"By"]
["To",null,null,"By","Balance C/d"]
[]
[null,null,{"$f":"SUM(C23:C32)","v":0},null,null,{"$f":"SUM(F23:F32)","v":0}]

{"sheet":"Sheet3","index":2,"n_rows":0,"n_cols":0,"rows_kept":0,"cut":false,"hidden":false,"merged":[]}

{"sheet":"Sys","index":3,"n_rows":5554,"n_cols":11,"rows_kept":5554,"cut":false,"hidden":false,"merged":[]}
[]
[]
[]
[]
[]
[]
[]
[]
[]
[]
[]
[]
[]
[]
[]
[]
[]
[]
[]
[]
[]
[]
[]
[]
[]
[]
[]
[]
[]
[]
[]
[]
[]
[]
[]
[]
[]
[]
[]
[]
[]
[]
[]
[]
[]
[]
[]
[]
[]
[]
[]
[]
[]
[]
[]
[]
[]
[]
[]
[]
[]
[]
[]
[]
[]
[]
[]
[]
[]
[]
[]
[]
[]
[]
[]
[]
[]
[]
[]
[]
[]
[]
[]
[]
[]
[]
[]
[]
[]
[]
[]
[]
[]
[]
[]
[]
[]
[]
[]
[]
[]
[]
[]
[]
[]
[]
[]
[]
[]
[]
[]
[]
[]
[]
[]
[]
[]
[]
[]
[]
[]
[]
[]
[]
[]
[]
[]
[]
[]
[]
[]
[]
[]
[]
[]
[]
[]
[]
[]
[]
[]
[]
[]
[]
[]
[]
[]
[]
[]
[]
[]
[]
[]
[]
[]
[]
[]
[]
[]
[]
[]
[]
[]
[]
[]
[]
[]
[]
[]
[]
[]
[]
[]
[]
[]
[]
[]
[]
[]
[]
[]
[]
[]
[]
[]
[]
[]
[]
[]
[]
[]
[]
[]
[]
[]
[]
[]
[]
[]
[]
[]
[]
[]
[]
[]
[]
[]
[]
[]
[]
[]
[]
[]
[]
[]
[]
[]
[]
[]
[]
[]
[]
[]
[]
[]
[]
[]
[]
[]
[]
[]
[]
[]
[]
[]
[]
[]
[]
[]
[]
[]
[]
[]
[]
[]
[]
[]
[]
[]
[]
[]
[]
[]
[]
[]
[]
[]
[]
[]
[]
[]
[]
[]
[]
[]
[]
[]
[]
[]
[]
[]
[]
[]
[]
[]
[]
[]
[]
[]
[]
[]
[]
[]
[]
[]
[]
[]
[]
[]
[]
[]
[]
[]
[]
[]
[]
[]
[]
[]
[]
[]
[]
[]
[]
[]
[]
[]
[]
[]
[]
[]
[]
[]
[]
[]
[]
[]
[]
[]
[]
[]
[]
[]
[]
[]
[]
[]
[]
[]
[]
[]
[]
[]
[]
[]
[]
[]
[]
[]
[]
[]
[]
[]
[]
[]
[]
[]
[]
[]
[]
[]
[]
[]
[]
[]
[]
[]
[]
[]
[]
[]
[]
[]
[]
[]
[]
[]
[]
[]
[]
[]
[]
[]
[]
[]
[]
[]
[]
[]
[]
[]
[]
[]
[]
[]
[]
[]
[]
[]
[]
[]
[]
[]
[]
[]
[]
[]
[]
[]
[]
[]
[]
[]
[]
[]
[]
[]
[]
[]
[]
[]
[]
[]
[]
[]
[]
[]
[]
[]
[]
[]
[]
[]
[]
[]
[]
[]
[]
[]
[]
[]
[]
[]
[]
[]
[]
[]
[]
[]
[]
[]
[]
[]
[]
[]
[]
[]
[]
[]
[]
[]
[]
[]
[]
[]
[]
[]
[]
[]
[]
[]
[]
[]
[]
[]
[]
[]
[]
[]
[]
[]
[]
[]
[]
[]
[]
[]
[]
[]
[]
[]
[]
[]
[]
[]
[]
[]
[]
[]
[]
[]
[]
[]
[]
[]
[]
[]
[]
[]
[]
[]
[]
[]
[]
[]
[]
[]
[]
[]
[]
[]
[]
[]
[]
[]
[]
[]
[]
[]
[]
[]
[]
[]
[]
[]
[]
[]
[]
[]
[]
[]
[]
[]
[]
[]
[]
[]
[]
[]
[]
[]
[]
[]
[]
[]
[]
[]
[]
[]
[]
[]
[]
[]
[]
[]
[]
[]
[]
[]
[]
[]
[]
[]
[]
[]
[]
[]
[]
[]
[]
[]
[]
[]
[]
[]
[]
[]
[]
[]
[]
[]
[]
[]
[]
[]
[]
[]
[]
[]
[]
[]
[]
[]
[]
[]
[]
[]
[]
[]
[]
[]
[]
[]
[]
[]
[]
[]
[]
[]
[]
[]
[]
[]
[]
[]
[]
[]
[]
[]
[]
[]
[]
[]
[]
[]
[]
[]
[]
[]
[]
[]
[]
[]
[]
[]
[]
[]
[]
[]
[]
[]
[]
[]
[]
[]
[]
[]
[]
[]
[]
[]
[]
[]
[]
[]
[]
[]
[]
[]
[]
[]
[]
[]
[]
[]
[]
[]
[]
[]
[]
[]
[]
[]
[]
[]
[]
[]
[]
[]
[]
[]
[]
[]
[]
[]
[]
[]
[]
[]
[]
[]
[]
[]
[]
[]
[]
[]
[]
[]
[]
[]
[]
[]
[]
[]
[]
[]
[]
[]
[]
[]
[]
[]
[]
[]
[]
[]
[]
[]
[]
[]
[]
[]
[]
[]
[]
[]
[]
[]
[]
[]
[]
[]
[]
[]
[]
[]
[]
[]
[]
[]
[]
[]
[]
[]
[]
[]
[]
[]
[]
[]
[]
[]
[]
[]
[]
[]
[]
[]
[]
[]
[]
[]
[]
[]
[]
[]
[]
[]
[]
[]
[]
[]
[]
[]
[]
[]
[]
[]
[]
[]
[]
[]
[]
[]
[]
[]
[]
[]
[]
[]
[]
[]
[]
[]
[]
[]
[]
[]
[]
[]
[]
[]
[]
[]
[]
[]
[]
[]
[]
[]
[]
[]
[]
[]
[]
[]
[]
[]
[]
[]
[]
[]
[]
[]
[]
[]
[]
[]
[]
[]
[]
[]
[]
[]
[]
[]
[]
[]
[]
[]
[]
[]
[]
[]
[]
[]
[]
[]
[]
[]
[]
[]
[]
[]
[]
[]
[]
[]
[]
[]
[]
[]
[]
[]
[]
[]
[]
[]
[]
[]
[]
[]
[]
[]
[]
[]
[]
[]
[]
[]
[]
[]
[]
[]
[]
[]
[]
[]
[]
[]
[]
[]
[]
[]
[]
[]
[]
[]
[]
[]
[]
[]
[]
[]
[]
[]
[]
[]
[]
[]
[]
[]
[]
[]
[]
[]
[]
[]
[]
[]
[]
[]
[]
[]
[]
[]
[]
[]
[]
[]
[]
[]
[]
[]
[]
[]
[]
[]
[]
[]
[]
[]
[]
[]
[]
[]
[]
[]
[]
[]
[]
[]
[]
[]
[]
[]
[]
[]
[]
[]
[]
[]
[]
[]
[]
[]
[]
[]
[]
[]
[]
[]
[]
[]
[]
[]
[]
[]
[]
[]
[]
[]
[]
[]
[]
[]
[]
[]
[]
[]
[]
[]
[]
[]
[]
[]
[]
[]
[]
[]
[]
[]
[]
[]
[]
[]
[]
[]
[]
[]
[]
[]
[]
[]
[]
[]
[]
[]
[]
[]
[]
[]
[]
[]
[]
[]
[]
[]
[]
[]
[]
[]
[]
[]
[]
[]
[]
[]
[]
[]
[]
[]
[]
[]
[]
[]
[]
[]
[]
[]
[]
[]
[]
[]
[]
[]
[]
[]
[]
[]
[]
[]
[]
[]
[]
[]
[]
[]
[]
[]
[]
[]
[]
[]
[]
[]
[]
[]
[]
[]
[]
[]
[]
[]
[]
[]
[]
[]
[]
[]
[]
[]
[]
[]
[]
[]
[]
[]
[]
[]
[]
[]
[]
[]
[]
[]
[]
[]
[]
[]
[]
[]
[]
[]
[]
[]
[]
[]
[]
[]
[]
[]
[]
[]
[]
[]
[]
[]
[]
[]
[]
[]
[]
[]
[]
[]
[]
[]
[]
[]
[]
[]
[]
[]
[]
[]
[]
[]
[]
[]
[]
[]
[]
[]
[]
[]
[]
[]
[]
[]
[]
[]
[]
[]
[]
[]
[]
[]
[]
[]
[]
[]
[]
[]
[]
[]
[]
[]
[]
[]
[]
[]
[]
[]
[]
[]
[]
[]
[]
[]
[]
[]
[]
[]
[]
[]
[]
[]
[]
[]
[]
[]
[]
[]
[]
[]
[]
[]
[]
[]
[]
[]
[]
[]
[]
[]
[]
[]
[]
[]
[]
[]
[]
[]
[]
[]
[]
[]
[]
[]
[]
[]
[]
[]
[]
[]
[]
[]
[]
[]
[]
[]
[]
[]
[]
[]
[]
[]
[]
[]
[]
[]
[]
[]
[]
[]
[]
[]
[]
[]
[]
[]
[]
[]
[]
[]
[]
[]
[]
[]
[]
[]
[]
[]
[]
[]
[]
[]
[]
[]
[]
[]
[]
[]
[]
[]
[]
[]
[]
[]
[]
[]
[]
[]
[]
[]
[]
[]
[]
[]
[]
[]
[]
[]
[]
[]
[]
[]
[]
[]
[]
[]
[]
[]
[]
[]
[]
[]
[]
[]
[]
[]
[]
[]
[]
[]
[]
[]
[]
[]
[]
[]
[]
[]
[]
[]
[]
[]
[]
[]
[]
[]
[]
[]
[]
[]
[]
[]
[]
[]
[]
[]
[]
[]
[]
[]
[]
[]
[]
[]
[]
[]
[]
[]
[]
[]
[]
[]
[]
[]
[]
[]
[]
[]
[]
[]
[]
[]
[]
[]
[]
[]
[]
[]
[]
[]
[]
[]
[]
[]
[]
[]
[]
[]
[]
[]
[]
[]
[]
[]
[]
[]
[]
[]
[]
[]
[]
[]
[]
[]
[]
[]
[]
[]
[]
[]
[]
[]
[]
[]
[]
[]
[]
[]
[]
[]
[]
[]
[]
[]
[]
[]
[]
[]
[]
[]
[]
[]
[]
[]
[]
[]
[]
[]
[]
[]
[]
[]
[]
[]
[]
[]
[]
[]
[]
[]
[]
[]
[]
[]
[]
[]
[]
[]
[]
[]
[]
[]
[]
[]
[]
[]
[]
[]
[]
[]
[]
[]
[]
[]
[]
[]
[]
[]
[]
[]
[]
[]
[]
[]
[]
[]
[]
[]
[]
[]
[]
[]
[]
[]
[]
[]
[]
[]
[]
[]
[]
[]
[]
[]
[]
[]
[]
[]
[]
[]
[]
[]
[]
[]
[]
[]
[]
[]
[]
[]
[]
[]
[]
[]
[]
[]
[]
[]
[]
[]
[]
[]
[]
[]
[]
[]
[]
[]
[]
[]
[]
[]
[]
[]
[]
[]
[]
[]
[]
[]
[]
[]
[]
[]
[]
[]
[]
[]
[]
[]
[]
[]
[]
[]
[]
[]
[]
[]
[]
[]
[]
[]
[]
[]
[]
[]
[]
[]
[]
[]
[]
[]
[]
[]
[]
[]
[]
[]
[]
[]
[]
[]
[]
[]
[]
[]
[]
[]
[]
[]
[]
[]
[]
[]
[]
[]
[]
[]
[]
[]
[]
[]
[]
[]
[]
[]
[]
[]
[]
[]
[]
[]
[]
[]
[]
[]
[]
[]
[]
[]
[]
[]
[]
[]
[]
[]
[]
[]
[]
[]
[]
[]
[]
[]
[]
[]
[]
[]
[]
[]
[]
[]
[]
[]
[]
[]
[]
[]
[]
[]
[]
[]
[]
[]
[]
[]
[]
[]
[]
[]
[]
[]
[]
[]
[]
[]
[]
[]
[]
[]
[]
[]
[]
[]
[]
[]
[]
[]
[]
[]
[]
[]
[]
[]
[]
[]
[]
[]
[]
[]
[]
[]
[]
[]
[]
[]
[]
[]
[]
[]
[]
[]
[]
[]
[]
[]
[]
[]
[]
[]
[]
[]
[]
[]
[]
[]
[]
[]
[]
[]
[]
[]
[]
[]
[]
[]
[]
[]
[]
[]
[]
[]
[]
[]
[]
[]
[]
[]
[]
[]
[]
[]
[]
[]
[]
[]
[]
[]
[]
[]
[]
[]
[]
[]
[]
[]
[]
[]
[]
[]
[]
[]
[]
[]
[]
[]
[]
[]
[]
[]
[]
[]
[]
[]
[]
[]
[]
[]
[]
[]
[]
[]
[]
[]
[]
[]
[]
[]
[]
[]
[]
[]
[]
[]
[]
[]
[]
[]
[]
[]
[]
[]
[]
[]
[]
[]
[]
[]
[]
[]
[]
[]
[]
[]
[]
[]
[]
[]
[]
[]
[]
[]
[]
[]
[]
[]
[]
[]
[]
[]
[]
[]
[]
[]
[]
[]
[]
[]
[]
[]
[]
[]
[]
[]
[]
[]
[]
[]
[]
[]
[]
[]
[]
[]
[]
[]
[]
[]
[]
[]
[]
[]
[]
[]
[]
[]
[]
[]
[]
[]
[]
[]
[]
[]
[]
[]
[]
[]
[]
[]
[]
[]
[]
[]
[]
[]
[]
[]
[]
[]
[]
[]
[]
[]
[]
[]
[]
[]
[]
[]
[]
[]
[]
[]
[]
[]
[]
[]
[]
[]
[]
[]
[]
[]
[]
[]
[]
[]
[]
[]
[]
[]
[]
[]
[]
[]
[]
[]
[]
[]
[]
[]
[]
[]
[]
[]
[]
[]
[]
[]
[]
[]
[]
[]
[]
[]
[]
[]
[]
[]
[]
[]
[]
[]
[]
[]
[]
[]
[]
[]
[]
[]
[]
[]
[]
[]
[]
[]
[]
[]
[]
[]
[]
[]
[]
[]
[]
[]
[]
[]
[]
[]
[]
[]
[]
[]
[]
[]
[]
[]
[]
[]
[]
[]
[]
[]
[]
[]
[]
[]
[]
[]
[]
[]
[]
[]
[]
[]
[]
[]
[]
[]
[]
[]
[]
[]
[]
[]
[]
[]
[]
[]
[]
[]
[]
[]
[]
[]
[]
[]
[]
[]
[]
[]
[]
[]
[]
[]
[]
[]
[]
[]
[]
[]
[]
[]
[]
[]
[]
[]
[]
[]
[]
[]
[]
[]
[]
[]
[]
[]
[]
[]
[]
[]
[]
[]
[]
[]
[]
[]
[]
[]
[]
[]
[]
[]
[]
[]
[]
[]
[]
[]
[]
[]
[]
[]
[]
[]
[]
[]
[]
[]
[]
[]
[]
[]
[]
[]
[]
[]
[]
[]
[]
[]
[]
[]
[]
[]
[]
[]
[]
[]
[]
[]
[]
[]
[]
[]
[]
[]
[]
[]
[]
[]
[]
[]
[]
[]
[]
[]
[]
[]
[]
[]
[]
[]
[]
[]
[]
[]
[]
[]
[]
[]
[]
[]
[]
[]
[]
[]
[]
[]
[]
[]
[]
[]
[]
[]
[]
[]
[]
[]
[]
[]
[]
[]
[]
[]
[]
[]
[]
[]
[]
[]
[]
[]
[]
[]
[]
[]
[]
[]
[]
[]
[]
[]
[]
[]
[]
[]
[]
[]
[]
[]
[]
[]
[]
[]
[]
[]
[]
[]
[]
[]
[]
[]
[]
[]
[]
[]
[]
[]
[]
[]
[]
[]
[]
[]
[]
[]
[]
[]
[]
[]
[]
[]
[]
[]
[]
[]
[]
[]
[]
[]
[]
[]
[]
[]
[]
[]
[]
[]
[]
[]
[]
[]
[]
[]
[]
[]
[]
[]
[]
[]
[]
[]
[]
[]
[]
[]
[]
[]
[]
[]
[]
[]
[]
[]
[]
[]
[]
[]
[]
[]
[]
[]
[]
[]
[]
[]
[]
[]
[]
[]
[]
[]
[]
[]
[]
[]
[]
[]
[]
[]
[]
[]
[]
[]
[]
[]
[]
[]
[]
[]
[]
[]
[]
[]
[]
[]
[]
[]
[]
[]
[]
[]
[]
[]
[]
[]
[]
[]
[]
[]
[]
[]
[]
[]
[]
[]
[]
[]
[]
[]
[]
[]
[]
[]
[]
[]
[]
[]
[]
[]
[]
[]
[]
[]
[]
[]
[]
[]
[]
[]
[]
[]
[]
[]
[]
[]
[]
[]
[]
[]
[]
[]
[]
[]
[]
[]
[]
[]
[]
[]
[]
[]
[]
[]
[]
[]
[]
[]
[]
[]
[]
[]
[]
[]
[]
[]
[]
[]
[]
[]
[]
[]
[]
[]
[]
[]
[]
[]
[]
[]
[]
[]
[]
[]
[]
[]
[]
[]
[]
[]
[]
[]
[]
[]
[]
[]
[]
[]
[]
[]
[]
[]
[]
[]
[]
[]
[]
[]
[]
[]
[]
[]
[]
[]
[]
[]
[]
[]
[]
[]
[]
[]
[]
[]
[]
[]
[]
[]
[]
[]
[]
[]
[]
[]
[]
[]
[]
[]
[]
[]
[]
[]
[]
[]
[]
[]
[]
[]
[]
[]
[]
[]
[]
[]
[]
[]
[]
[]
[]
[]
[]
[]
[]
[]
[]
[]
[]
[]
[]
[]
[]
[]
[]
[]
[]
[]
[]
[]
[]
[]
[]
[]
[]
[]
[]
[]
[]
[]
[]
[]
[]
[]
[]
[]
[]
[]
[]
[]
[]
[]
[]
[]
[]
[]
[]
[]
[]
[]
[]
[]
[]
[]
[]
[]
[]
[]
[]
[]
[]
[]
[]
[]
[]
[]
[]
[]
[]
[]
[]
[]
[]
[]
[]
[]
[]
[]
[]
[]
[]
[]
[]
[]
[]
[]
[]
[]
[]
[]
[]
[]
[]
[]
[]
[]
[]
[]
[]
[]
[]
[]
[]
[]
[]
[]
[]
[]
[]
[]
[]
[]
[]
[]
[]
[]
[]
[]
[]
[]
[]
[]
[]
[]
[]
[]
[]
[]
[]
[]
[]
[]
[]
[]
[]
[]
[]
[]
[]
[]
[]
[]
[]
[]
[]
[]
[]
[]
[]
[]
[]
[]
[]
[]
[]
[]
[]
[]
[]
[]
[]
[]
[]
[]
[]
[]
[]
[]
[]
[]
[]
[]
[]
[]
[]
[]
[]
[]
[]
[]
[]
[]
[]
[]
[]
[]
[]
[]
[]
[]
[]
[]
[]
[]
[]
[]
[]
[]
[]
[]
[]
[]
[]
[]
[]
[]
[]
[]
[]
[]
[]
[]
[]
[]
[]
[]
[]
[]
[]
[]
[]
[]
[]
[]
[]
[]
[]
[]
[]
[]
[]
[]
[]
[]
[]
[]
[]
[]
[]
[]
[]
[]
[]
[]
[]
[]
[]
[]
[]
[]
[]
[]
[]
[]
[]
[]
[]
[]
[]
[]
[]
[]
[]
[]
[]
[]
[]
[]
[]
[]
[]
[]
[]
[]
[]
[]
[]
[]
[]
[]
[]
[]
[]
[]
[]
[]
[]
[]
[]
[]
[]
[]
[]
[]
[]
[]
[]
[]
[]
[]
[]
[]
[]
[]
[]
[]
[]
[]
[]
[]
[]
[]
[]
[]
[]
[]
[]
[]
[]
[]
[]
[]
[]
[]
[]
[]
[]
[]
[]
[]
[]
[]
[]
[]
[]
[]
[]
[]
[]
[]
[]
[]
[]
[]
[]
[]
[]
[]
[]
[]
[]
[]
[]
[]
[]
[]
[]
[]
[]
[]
[]
[]
[]
[]
[]
[]
[]
[]
[]
[]
[]
[]
[]
[]
[]
[]
[]
[]
[]
[]
[]
[]
[]
[]
[]
[]
[]
[]
[]
[]
[]
[]
[]
[]
[]
[]
[]
[]
[]
[]
[]
[]
[]
[]
[]
[]
[]
[]
[]
[]
[]
[]
[]
[]
[]
[]
[]
[]
[]
[]
[]
[]
[]
[]
[]
[]
[]
[]
[]
[]
[]
[]
[]
[]
[]
[]
[]
[]
[]
[]
[]
[]
[]
[]
[]
[]
[]
[]
[]
[]
[]
[]
[]
[]
[]
[]
[]
[]
[]
[]
[]
[]
[]
[]
[]
[]
[]
[]
[]
[]
[]
[]
[]
[]
[]
[]
[]
[]
[]
[]
[]
[]
[]
[]
[]
[]
[]
[]
[]
[]
[]
[]
[]
[]
[]
[]
[]
[]
[]
[]
[]
[]
[]
[]
[]
[]
[]
[]
[]
[]
[]
[]
[]
[]
[]
[]
[]
[]
[]
[]
[]
[]
[]
[]
[]
[]
[]
[]
[]
[]
[]
[]
[]
[]
[]
[]
[]
[]
[]
[]
[]
[]
[]
[]
[]
[]
[]
[]
[]
[]
[]
[]
[]
[]
[]
[]
[]
[]
[]
[]
[]
[]
[]
[]
[]
[]
[]
[]
[]
[]
[]
[]
[]
[]
[]
[]
[]
[]
[]
[]
[]
[]
[]
[]
[]
[]
[]
[]
[]
[]
[]
[]
[]
[]
[]
[]
[]
[]
[]
[]
[]
[]
[]
[]
[]
[]
[]
[]
[]
[]
[]
[]
[]
[]
[]
[]
[]
[]
[]
[]
[]
[]
[]
[]
[]
[]
[]
[]
[]
[]
[]
[]
[]
[]
[]
[]
[]
[]
[]
[]
[]
[]
[]
[]
[]
[]
[]
[]
[]
[]
[]
[]
[]
[]
[]
[]
[]
[]
[]
[]
[]
[]
[]
[]
[]
[]
[]
[]
[]
[]
[]
[]
[]
[]
[]
[]
[]
[]
[]
[]
[]
[]
[]
[]
[]
[]
[]
[]
[]
[]
[]
[]
[]
[]
[]
[]
[]
[]
[]
[]
[]
[]
[]
[]
[]
[]
[]
[]
[]
[]
[]
[]
[]
[]
[]
[]
[]
[]
[]
[]
[]
[]
[]
[]
[]
[]
[]
[]
[]
[]
[]
[]
[]
[]
[]
[]
[]
[]
[]
[]
[]
[]
[]
[]
[]
[]
[]
[]
[]
[]
[]
[]
[]
[]
[]
[]
[]
[]
[]
[]
[]
[]
[]
[]
[]
[]
[]
[]
[]
[]
[]
[]
[]
[]
[]
[]
[]
[]
[]
[]
[]
[]
[]
[]
[]
[]
[]
[]
[]
[]
[]
[]
[]
[]
[]
[]
[]
[]
[]
[]
[]
[]
[]
[]
[]
[]
[]
[]
[]
[]
[]
[]
[]
[]
[]
[]
[]
[]
[]
[]
[]
[]
[]
[]
[]
[]
[]
[]
[]
[]
[]
[]
[]
[]
[]
[]
[]
[]
[]
[]
[]
[]
[]
[]
[]
[]
[]
[]
[]
[]
[]
[]
[]
[]
[]
[]
[]
[]
[]
[]
[]
[]
[]
[]
[]
[]
[]
[]
[]
[]
[]
[]
[]
[]
[]
[]
[]
[]
[]
[]
[]
[]
[]
[]
[]
[]
[]
[]
[]
[]
[]
[]
[]
[]
[]
[]
[]
[]
[]
[]
[]
[]
[]
[]
[]
[]
[]
[]
[]
[]
[]
[]
[]
[]
[]
[]
[]
[]
[]
[]
[]
[]
[]
[]
[]
[]
[]
[]
[]
[]
[]
[]
[]
[]
[]
[]
[]
[]
[]
[]
[]
[]
[]
[]
[]
[]
[]
[]
[]
[]
[]
[]
[]
[]
[]
[]
[]
[]
[]
[]
[]
[]
[]
[]
[]
[]
[]
[]
[]
[]
[]
[]
[]
[]
[]
[]
[]
[]
[]
[]
[]
[]
[]
[]
[]
[]
[]
[]
[]
[]
[]
[]
[]
[]
[]
[]
[]
[]
[]
[]
[]
[]
[]
[]
[]
[]
[]
[]
[]
[]
[]
[]
[]
[]
[]
[]
[]
[]
[]
[]
[]
[]
[]
[]
[]
[]
[]
[]
[]
[]
[]
[]
[]
[]
[]
[]
[]
[]
[]
[]
[]
[]
[]
[]
[]
[]
[]
[]
[]
[]
[]
[]
[]
[]
[]
[]
[]
[]
[]
[]
[]
[]
[]
[]
[]
[]
[]
[]
[]
[]
[]
[]
[]
[]
[]
[]
[]
[]
[]
[]
[]
[]
[]
[]
[]
[]
[]
[]
[]
[]
[]
[]
[]
[]
[]
[]
[]
[]
[]
[]
[]
[]
[]
[]
[]
[]
[]
[]
[]
[]
[]
[]
[]
[]
[]
[]
[]
[]
[]
[]
[]
[]
[]
[]
[]
[]
[]
[]
[]
[]
[]
[]
[]
[]
[]
[]
[]
[]
[]
[]
[]
[]
[]
[]
[]
[]
[]
[]
[]
[]
[]
[]
[]
[]
[]
[]
[]
[]
[]
[]
[]
[]
[]
[]
[]
[]
[]
[]
[]
[]
[]
[]
[]
[]
[]
[]
[]
[]
[]
[]
[]
[]
[]
[]
[]
[]
[]
[]
[]
[]
[]
[]
[]
[]
[]
[]
[]
[]
[]
[]
[]
[]
[]
[]
[]
[]
[]
[]
[]
[]
[]
[]
[]
[]
[]
[]
[]
[]
[]
[]
[]
[]
[]
[]
[]
[]
[]
[]
[]
[]
[]
[]
[]
[]
[]
[]
[]
[]
[]
[]
[]
[]
[]
[]
[]
[]
[]
[]
[]
[]
[]
[]
[]
[]
[]
[]
[]
[]
[]
[]
[]
[]
[]
[]
[]
[]
[]
[]
[]
[]
[]
[]
[]
[]
[]
[]
[]
[]
[]
[]
[]
[]
[]
[]
[]
[]
[]
[]
[]
[]
[]
[]
[]
[]
[]
[]
[]
[]
[]
[]
[]
[]
[]
[]
[]
[]
[]
[]
[]
[]
[]
[]
[]
[]
[]
[]
[]
[]
[]
[]
[]
[]
[]
[]
[]
[]
[]
[]
[]
[]
[]
[]
[]
[]
[]
[]
[]
[]
[]
[]
[]
[]
[]
[]
[]
[]
[]
[]
[]
[]
[]
[]
[]
[]
[]
[]
[]
[]
[]
[]
[]
[]
[]
[]
[]
[]
[]
[]
[]
[]
[]
[]
[]
[]
[]
[]
[]
[]
[]
[]
[]
[]
[]
[]
[]
[]
[]
[]
[]
[]
[]
[]
[]
[]
[]
[]
[]
[]
[]
[]
[]
[]
[]
[]
[]
[]
[]
[]
[]
[]
[]
[]
[]
[]
[]
[]
[]
[]
[]
[]
[]
[]
[]
[]
[]
[]
[]
[]
[]
[]
[]
[]
[]
[]
[]
[]
[]
[]
[]
[]
[]
[]
[]
[]
[]
[]
[]
[]
[]
[]
[]
[]
[]
[]
[]
[]
[]
[]
[]
[]
[]
[]
[]
[]
[]
[]
[]
[]
[]
[]
[]
[]
[]
[]
[]
[]
[]
[]
[]
[]
[]
[]
[]
[]
[]
[]
[]
[]
[]
[]
[]
[]
[]
[]
[]
[]
[]
[]
[]
[]
[]
[]
[]
[]
[]
[{"$f":"SUM(A1:A4004)","v":0},null,null,null,null,null,{"$f":"SUM(G1:G4004)","v":0},null,{"$f":"A4005-G4005","v":0},{"$f":"IF(I4005<>0,IF(I4005<0,(IF(A4005=0,\"rcvbl\",\"rcvbl\")),\"pybl\"),\"Nil\")","v":"Nil"},{"$f":"ROUND(ABS(I4005),2)","v":0}]
[]
[]
[]
[]
[]
[]
[]
[]
[]
[]
[]
[]
[]
[]
[]
[]
[]
[]
[]
[]
[]
[]
[]
[]
[]
[]
[]
[]
[]
[]
[]
[]
[]
[]
[]
[]
[]
[]
[]
[]
[]
[]
[]
[]
[]
[]
[]
[]
[]
[]
[]
[]
[]
[]
[]
[]
[]
[]
[]
[]
[]
[]
[]
[]
[]
[]
[]
[]
[]
[]
[]
[]
[]
[]
[]
[]
[]
[]
[]
[]
[]
[]
[]
[]
[]
[]
[]
[]
[]
[]
[]
[]
[]
[]
[]
[]
[]
[]
[]
[]
[]
[]
[]
[]
[]
[]
[]
[]
[]
[]
[]
[]
[]
[]
[]
[]
[]
[]
[]
[]
[]
[]
[]
[]
[]
[]
[]
[]
[]
[]
[]
[]
[]
[]
[]
[]
[]
[]
[]
[]
[]
[]
[]
[]
[]
[]
[]
[]
[]
[]
[]
[]
[]
[]
[]
[]
[]
[]
[]
[]
[]
[]
[]
[]
[]
[]
[]
[]
[]
[]
[]
[]
[]
[]
[]
[]
[]
[]
[]
[]
[]
[]
[]
[]
[]
[]
[]
[]
[]
[]
[]
[]
[]
[]
[]
[]
[]
[]
[]
[]
[]
[]
[]
[]
[]
[]
[]
[]
[]
[]
[]
[]
[]
[]
[]
[]
[]
[]
[]
[]
[]
[]
[]
[]
[]
[]
[]
[]
[]
[]
[]
[]
[]
[]
[]
[]
[]
[]
[]
[]
[]
[]
[]
[]
[]
[]
[]
[]
[]
[]
[]
[]
[]
[]
[]
[]
[]
[]
[]
[]
[]
[]
[]
[]
[]
[]
[]
[]
[]
[]
[]
[]
[]
[]
[]
[]
[]
[]
[]
[]
[]
[]
[]
[]
[]
[]
[]
[]
[]
[]
[]
[]
[]
[]
[]
[]
[]
[]
[]
[]
[]
[]
[]
[]
[]
[]
[]
[]
[]
[]
[]
[]
[]
[]
[]
[]
[]
[]
[]
[]
[]
[]
[]
[]
[]
[]
[]
[]
[]
[]
[]
[]
[]
[]
[]
[]
[]
[]
[]
[]
[]
[]
[]
[]
[]
[]
[]
[]
[]
[]
[]
[]
[]
[]
[]
[]
[]
[]
[]
[]
[]
[]
[]
[]
[]
[]
[]
[]
[]
[]
[]
[]
[]
[]
[]
[]
[]
[]
[]
[]
[]
[]
[]
[]
[]
[]
[]
[]
[]
[]
[]
[]
[]
[]
[]
[]
[]
[]
[]
[]
[]
[]
[]
[]
[]
[]
[]
[]
[]
[]
[]
[]
[]
[]
[]
[]
[]
[]
[]
[]
[]
[]
[]
[]
[]
[]
[]
[]
[]
[]
[]
[]
[]
[]
[]
[]
[]
[]
[]
[]
[]
[]
[]
[]
[]
[]
[]
[]
[]
[]
[]
[]
[]
[]
[]
[]
[]
[]
[]
[]
[]
[]
[]
[]
[]
[]
[]
[]
[]
[]
[]
[]
[]
[]
[]
[]
[]
[]
[]
[]
[]
[]
[]
[]
[]
[]
[]
[]
[]
[]
[]
[]
[]
[]
[]
[]
[]
[]
[]
[]
[]
[]
[]
[]
[]
[]
[]
[]
[]
[]
[]
[]
[]
[]
[]
[]
[]
[]
[]
[]
[]
[]
[]
[]
[]
[]
[]
[]
[]
[]
[]
[]
[]
[]
[]
[]
[]
[]
[]
[]
[]
[]
[]
[]
[]
[]
[]
[]
[]
[]
[]
[]
[]
[]
[]
[]
[]
[]
[]
[]
[]
[]
[]
[]
[]
[]
[]
[]
[]
[]
[]
[]
[]
[]
[]
[]
[]
[]
[]
[]
[]
[]
[]
[]
[]
[]
[]
[]
[]
[]
[]
[]
[]
[]
[]
[]
[]
[]
[]
[]
[]
[]
[]
[]
[]
[]
[]
[]
[]
[]
[]
[]
[]
[]
[]
[]
[]
[]
[]
[]
[]
[]
[]
[]
[]
[]
[]
[]
[]
[]
[]
[]
[]
[]
[]
[]
[]
[]
[]
[]
[]
[]
[]
[]
[]
[]
[]
[]
[]
[]
[]
[]
[]
[]
[]
[]
[]
[]
[]
[]
[]
[]
[]
[]
[]
[]
[]
[]
[]
[]
[]
[]
[]
[]
[]
[]
[]
[]
[]
[]
[]
[]
[]
[]
[]
[]
[]
[]
[]
[]
[]
[]
[]
[]
[]
[]
[]
[]
[]
[]
[]
[]
[]
[]
[]
[]
[]
[]
[]
[]
[]
[]
[]
[]
[]
[]
[]
[]
[]
[]
[]
[]
[]
[]
[]
[]
[]
[]
[]
[]
[]
[]
[]
[]
[]
[]
[]
[]
[]
[]
[]
[]
[]
[]
[]
[]
[]
[]
[]
[]
[]
[]
[]
[]
[]
[]
[]
[]
[]
[]
[]
[]
[]
[]
[]
[]
[]
[]
[]
[]
[]
[]
[]
[]
[]
[]
[]
[]
[]
[]
[]
[]
[]
[]
[]
[]
[]
[]
[]
[]
[]
[]
[]
[]
[]
[]
[]
[]
[]
[]
[]
[]
[]
[]
[]
[]
[]
[]
[]
[]
[]
[]
[]
[]
[]
[]
[]
[]
[]
[]
[]
[]
[]
[]
[]
[]
[]
[]
[]
[]
[]
[]
[]
[]
[]
[]
[]
[]
[]
[]
[]
[]
[]
[]
[]
[]
[]
[]
[]
[]
[]
[]
[]
[]
[]
[]
[]
[]
[]
[]
[]
[]
[]
[]
[]
[]
[]
[]
[]
[]
[]
[]
[]
[]
[]
[]
[]
[]
[]
[]
[]
[]
[]
[]
[]
[]
[]
[]
[]
[]
[]
[]
[]
[]
[]
[]
[]
[]
[]
[]
[]
[]
[]
[]
[]
[]
[]
[]
[]
[]
[]
[]
[]
[]
[]
[]
[]
[]
[]
[]
[]
[]
[]
[]
[]
[]
[]
[]
[]
[]
[]
[]
[]
[]
[]
[]
[]
[]
[]
[]
[]
[]
[]
[]
[]
[]
[]
[]
[]
[]
[]
[]
[]
[]
[]
[]
[]
[]
[]
[]
[]
[]
[]
[]
[]
[]
[]
[]
[]
[]
[]
[]
[]
[]
[]
[]
[]
[]
[]
[]
[]
[]
[]
[]
[]
[]
[]
[]
[]
[]
[]
[]
[]
[]
[]
[]
[]
[]
[]
[]
[]
[]
[]
[]
[]
[]
[]
[]
[]
[]
[]
[]
[]
[]
[]
[]
[]
[]
[]
[]
[]
[]
[]
[]
[]
[]
[]
[]
[]
[]
[]
[]
[]
[]
[]
[]
[]
[]
[]
[]
[]
[]
[]
[]
[]
[]
[]
[]
[]
[]
[]
[]
[]
[]
[]
[]
[]
[]
[]
[]
[]
[]
[]
[]
[]
[]
[]
[]
[]
[]
[]
[]
[]
[]
[]
[]
[]
[]
[]
[]
[]
[]
[]
[]
[]
[]
[]
[]
[]
[]
[]
[]
[]
[]
[]
[]
[]
[]
[]
[]
[]
[]
[]
[]
[]
[]
[]
[]
[]
[]
[]
[]
[]
[]
[]
[]
[]
[]
[]
[]
[]
[]
[]
[]
[]
[]
[]
[]
[]
[]
[]
[]
[]
[]
[]
[]
[]
[]
[]
[]
[]
[]
[]
[]
[]
[]
[]
[]
[]
[]
[]
[]
[]
[]
[]
[]
[]
[]
[]
[]
[]
[]
[]
[]
[]
[]
[]
[]
[]
[]
[]
[]
[]
[]
[]
[]
[]
[]
[]
[]
[]
[]
[]
[]
[]
[]
[]
[]
[]
[]
[]
[]
[]
[]
[]
[]
[]
[]
[]
[]
[]
[]
[]
[]
[]
[]
[]
[]
[]
[]
[]
[]
[]
[]
[]
[]
[]
[]
[]
[]
[]
[]
[]
[]
[]
[]
[]
[]
[]
[]
[]
[]
[]
[]
[]
[]
[]
[]
[]
[]
[]
[]
[]
[]
[]
[]
[]
[]
[]
[]
[]
[]
[]
[]
[]
[]
[]
[]
[]
[]
[]
[]
[]
[]
[]
[]
[]
[]
[]
[]
[]
[]
[]
[]
[]
[]
[]
[]
[]
[]
[]
[]
[]
[]
[]
[]
[]
[]
[]
[]
[]
[]
[]
[]
[]
[]
[]
[]
[]
[]
[]
[]
[]
[]
[]
[]
[]
[]
[]
[]
[]
[]
[]
[]
[]
[]
[]
[]
[]
[]
[]
[]
[]
[]
[]
[]
[]
[]
[]
[]
[]
[]
[]
[]
[]
[]
[]
[]
[]
[]
[]
[]
[]
[]
[]
[]
[]
[]
[]
[]
[]
[]
[]
[]
[]
[]
[]
[]
[]
[]
[]
[]
[]
[]
[]
[]
[]
[]
[]
[]
[]
[]
[]
[]
[]
[]
[]
[]
[]
[]
[]
[]
[]
[]
[]
[]
[]
[]
[]
[]
[]
[]
[]
[]
[]
[]
[]
[]
[]
[]
[]
[]
[]
[]
[]
[]
[]
[]
[]
[]
[]
[]
[]
[]
[]
[]
[]
[]
[]
[]
[]
[]
[]
[]
[]
[]
[]
[]
[]
[]
[]
[]
[]
[]
[]
[]
[]
[]
[]
[]
[]
[]
[]
[]
[]
[]
[]
[]
[]
[]
[]
[]
[]
[]
[]
[]
[]
[]
[]
[]
[]
[]
[]
[]
[]
[]
[]
[]
[]
[]
[]
[]
[]
[]
[]
[]
[]
[]
[]
[]
[]
[]
[]
[]
[]
[]
[]
[]
[]
[]
[]
[]
[]
[]
[]
[]
[]
[]
[]
[]
[]
[]
[]
[]
[]
[]
[]
[]
[]
[]
[]
[]
[]
[]
[]
[]
[]
[]
[]
[]
[]
[]
[]
[]
[]
[]
[]
[]
[]
[]
[]
[]
[]
[]
[]
[]
[]
[]
[]
[]
[]
[]
[]
[]
["2:1"]
[{"$f":"LEN(A5550)","v":3},"total"]
[{"$f":"SEARCH(\":\",A5550,1)","v":2},"char div"]
[{"$f":"LEFT(A5550,A5552-1)","v":"2"},"left"]
[{"$f":"RIGHT(A5550,A5551-A5552)","v":"1"},"right"]